entity position x: 480.3656611576848
entity position y: 20.249543444781693
comment: This is an entity positioning annotation generated by CoModIDE (https://comodide.com/). Removing this annotation will break rendering the CoModIDE schema diagram view.

entity position x: 720.2334252962013
entity position y: 190.3171982754311
comment: This is an entity positioning annotation generated by CoModIDE (https://comodide.com/). Removing this annotation will break rendering the CoModIDE schema diagram view.

entity position x: 229.62975013492382
entity position y: 219.89132539281042
comment: This is an entity positioning annotation generated by CoModIDE (https://comodide.com/). Removing this annotation will break rendering the CoModIDE schema diagram view.

entity position x: 430.2699338347467
entity position y: 189.58940282234107
comment: This is an entity positioning annotation generated by CoModIDE (https://comodide.com/). Removing this annotation will break rendering the CoModIDE schema diagram view.

ADD
type: DatatypeProperty
comment: The procedure for aggregation / deaggregation of packaging, pallets, containers. The "action=ADD" data is determined when the AggregationEvent event is generated when the operation is committed by the IoT equipment.
comment: Процедура агрегации/деагрегации упаково, паллет, контейнеров. Данные "action=ADD" определяются при формировании события AggregationEvent при фиксации операции оборудованием IoT. @ru
domain: EPCIS Event
range: string
sub property of: action

AggregationEvent
type: Class
comment: The event type AggregationEvent describes events that apply to objects that have been aggregated to one another. In such an event, there is a set of “contained” objects that have been aggregated within a “containing” entity that’s meant to identify the aggregation itself. EPCIS Standard
comment: Тип события AggregationEvent описывает события, которые применяются к объектам, которые были объединены друг с другом. В таком случае существует набор «содержащихся» объектов, которые были агрегированы в «содержащей» сущности, предназначенной для идентификации самой агрегации. @ru
label: Агрегация @ru
subclass of: EPCIS Event

AssotiationEvent
type: Class
comment: The event type AssociationEvent describes the association or disassociation of one or several physical objects with a parent object or a specific physical location. Like the AggregationEvent, the AssociationEvent is also used to capture associations where there is a strong physical relationship between the containing and the contained objects such that they will all occupy the same location at the same time, until such time as they are disaggregated. However, the AggregationEvent does not allow for associations of objects with physical locations; if action is DELETE while omitting the childEPC and childQuantityList field, all contained children are disaggregated from the containing parent. @ru
comment: Тип события AssociationEvent описывает ассоциацию или разъединение одного или нескольких физических объектов с родительским объектом или определенным физическим местоположением. Как и AggregationEvent, AssociationEvent также используется для захвата ассоциаций, в которых существует сильная физическая связь. между вмещающим и вмещаемым объектами таким образом, что все они будут занимать одно и то же место в одно и то же время до тех пор, пока они не дезагрегированы.
label: Ассоциация @ru
subclass of: EPCIS Event

BusinesLocationID
type: DatatypeProperty
comment: GLN локации @ru
comment: Location GLN.
domain: Location
range: anyURI
sub property of: locationID

Business Step
type: Class
comment: A business step is a specific point in the business processes of the supply chain. The business step field of the event defines the business context of the event: what was the step of the business process that caused the registration of the event. The template for the meaning of business steps in the EPCIS document has the following form: urn: epcglobal: cbv: bizstep: shipment.
comment: Бизнес-шаг (BusinessStep) – это конкретная точка в бизнес-процессах цепочки поставок. Поле бизнес-шага события определяет бизнес-контекст события: какой был шаг бизнес-процесса, который вызвал регистрацию события. Шаблон для значения бизнес-шагов в EPCIS документе, имеет следующий вид: urn: epcglobal: cbv: bizstep: отгрузка @ru
label: Бизнес-шаги @ru
subclass of: CBV

BusinessStepID
type: DatatypeProperty
comment: The value of the business step in the given location.
comment: Значение бизнес шага в данной локации. @ru
domain: Business Step
range: anyURI
sub property of: locationID

Business Transaction
type: Class
comment: Business Transaction identifies a specific transaction associated with an EDI document applied at a specific point in the supply chain. An example of a business transaction is a specific "purchase order". Business transaction information can be included in EPCIS events to register the event's participation in specific business transactions. When describing in an XML document, the following URIs are used: - urn:epcglobal:cbv:btt:po - urn:epcglobal:cbv:btt:po: 4810531900009:123
comment: Business Transaction идентифицирует конкретную транзакцию, связанную с EDI документом, применяемым в конкретной точке цепочки поставок. Примером бизнес-транзакции является конкретный «заказ на поставку». Информация о бизнес - транзакциях может включаться в события EPCIS для регистрации участия события в конкретных бизнес - транзакциях. При описании в XML-документе используется следующие URI: - urn:epcglobal:cbv:btt:po - urn:epcglobal:cbv:btt:po: 4810531900009:123 @ru
label: Бизнес транзакии @ru
subclass of: CBV

Conteiner
type: Class
comment: A standard box designed for the transportation of goods by various modes of transport (roads, rail, ships) and adapted for mechanized reloading from one mode of transport to another (cranes, pilers, etc.)
comment: Cтандартный ящик, предназначенный для перевозки грузов различными видами транспорта (автомобилями, железной дорогой, судами) и приспособленный для механизированной перегрузки с одного вида транспорта на другой (подъёмными кранами, штабелёрами и т. д.) @ru
label: Контейнер @ru
subclass of: ProductBatch/Lot
subclass of: ProductBatch
equivalent class: Container

DELETE
type: DatatypeProperty
comment: The procedure for deaggregation of packages, pallets, containers. The "action=DELETE" data is determined when the AggregationEvent event is generated when the operation is committed by the IoT equipment.
comment: Процедура деагрегации упаковок, паллет, контейнеров. Данные "action=DELETE" определяются при формировании события AggregationEvent при фиксации операции оборудованием IoT. @ru
domain: EPCIS Event
range: string
sub property of: action

Disposition
type: Class
comment: Disposition denotes the business state of the object. It is assumed that the disposition persists until another event indicates a change in disposition. Intermediate events that do not define the disposition field do not affect the intended location of the object. Sometimes, in practice, the disposition is replaced by the concept – the state of the object (product) in the supply chain. All values of dispositions have the following form: urn:epcglobal:cbv:disp:payload
comment: Disposition обозначают бизнес-состояние объекта. Предполагается, что диспозиция сохраняется до тех пор, пока другое событие не укажет на изменение диспозиции. Промежуточные события, которые не определяют поле диспозиции, не влияют на предполагаемое расположение объекта. Иногда, на практике диспозиция заменяется понятие – состояние объекта (товара) в цепочке поставок. Все значения диспозиций имеют следующий вид: urn:epcglobal:cbv:disp:payload @ru
label: Диспозиция @ru
subclass of: CBV

EPCIS Document
type: Class
comment: EPCISDocument is a standard, standardized format for data exchange when using EPCIS services (Capture, Query and Subscription).
comment: EPCISDocument является типовым, стандартизованным форматом обмена данными при использованиисервисов EPCIS (Capture, Query и Subscription). @ru
label: EPCIS документ @ru
subclass of: Concepts of event recording technology in supply chains based on EPCIS services in accordance with ISO/IEC 19987:2017 Information Technology - EPC Information Services (EPCIS) standard.

EPCIS Event
type: Class
comment: EPCISEvent is a common base type for all EPCIS events. All of the more specific event types in the following sections are subclasses of EPCISEvent
comment: Корневым классом является EPCISEvent, определяющий 6 общих для всех событий полей, которые далее наследуются подклассами конкретных событий. @ru
label: События EPCIS @ru
subclass of: Concepts of event recording technology in supply chains based on EPCIS services in accordance with ISO/IEC 19987:2017 Information Technology - EPC Information Services (EPCIS) standard.
equivalent class: Restriction
  on property: фиксация события
  some values from: EPCISRepository

Event Dimention
type: Class
comment: The Event Dimensions class defines the types of measurements of events in the supply chain (what, when, where, why, how) was recorded for the controlled object.
comment: Класс EventDimentions определяет типы измерений соытий в цепочке поставок (что, когда, где почему, как) было зафиксировано для контролируемого объекта. @ru
label: ИзмеренияСобытий @ru
subclass of: Concepts of event recording technology in supply chains based on EPCIS services in accordance with ISO/IEC 19987:2017 Information Technology - EPC Information Services (EPCIS) standard.

HOW
type: Class
comment: This measurement applies to each of the event types if the event data is recorded automatically by IoT sensors. At the same time, the SensorElement attribute or for the Sensor Element List is added to the events.
comment: Данное измерение относится к каждому из типов событий, если данные о событии фиксируются автоматически сенсорами IoT. При этом, в событиях добавляется атрибут SensorElement или для списка сенсоров SensorElementList. @ru
label: КАК @ru
subclass of: Event Dimention

ILMD
type: NamedIndividual
type: EPCIS Document
type: EPCIS Event
type: Event Dimention
type: ObjectEvent
type: Other fields
type: TransformationEvent
comment: Instance/Lot Master Data
comment: Отгрузка/Номер партии @ru

Location
type: Class
comment: The point of fixing an event in the supply chain. The location is identified by the GLN key.
comment: Точка фиксации события в цепочке поставок. Локация идентифицируется ключом GLN. @ru
label: Локация @ru
subclass of: CBV

OBSERVE
type: DatatypeProperty
comment: The procedure for controlling objects during the supply chain. The "action=OBSERVE" data is determined when the ObjectEvent event is generated when the operation is committed by the IoT equipment.
comment: Процедура контроля объектов при прохождении цепочки поставок. Данные "action=OBSERVE" определяются при формировании события ObjectEvent при фиксации операции оборудованием IoT. @ru
domain: EPCIS Event
range: string
sub property of: action

Object
type: Class
comment: An object is a concept that includes any unit (goods, packaging, pallet, logistics unit, container, etc.) controlled by a supply chain monitoring system and whose event history is stored in EPCIS and in blockchain transactions.
comment: Объект - понятие, включающее любую единицу (товар, упаковку, паллету, логистическую единицу, контейнер и т.д) контролируемую системой мониторинга цепочек поставки и событийная история которого сохраняется в EPCIS и в транзакциях блокчейн. @ru
label: Объект @ru
subclass of: CBV

ObjectEvent
type: Class
comment: An ObjectEvent captures information about an event pertaining to one or more physical or digital objects identified by instance-level (EPC) or class-level (EPC Class) identifiers. In most situations, an ObjectEvent is envisioned to represent an actual observations of objects, but strictly speaking it can be used for any event a Capturing Application wants to assert about objects, including for example capturing the fact that an expected observation failed to occur.
comment: ObjectEvent фиксирует информацию о событии, относящемся к одному или нескольким физическим или цифровым объектам. Объекты идентифицированы идентификаторами уровня экземпляра (EPC) или уровня класса (класс EPC). Предполагается, что большинство событий ObjectEvent представляют фактические наблюдения за объектами, но, строго говоря, их можно использовать для любого события, которое фиксирующее приложение хочет знать об объектах, включая, например, фиксация факта, что ожидаемое наблюдение не произошло. @ru
label: Событие с объектом @ru
subclass of: EPCIS Event

Other fields
type: Class
comment: Additional fields (class OtherFields) applicable in dimension descriptions include an event handling error indicator (for all events), an event ID (for all events), an ILMD for shipment/batch numbering, and a transformation operation ID for the TransformationEvent event.
comment: Дополнительные поля, применимые в описаниях измерений включают указатель ошибки при обработке события (для всех событий), идентификатор события (для всех событий), ILMD для нумерации отгрузки/партии товара и идентификатор операции трансформации для события TransformationEvent. @ru
label: Другие поля @ru
subclass of: Event Dimention

Package
type: Class
comment: A product intended for the placement, protection, movement, delivery, storage, transportation and display of goods (raw materials and finished products), used both by the manufacturer, user or consumer, and by the processor, assembler or other intermediary
comment: Изделие, предназначенное для размещения, защиты, перемещения, доставки, хранения, транспортирования и демонстрации товаров (сырья и готовой продукции), используемое как производителем, пользователем или потребителем, так и переработчиком, сборщиком или иным посредником @ru
label: Упаковка @ru
subclass of: Pallet
equivalent class: Package

Pallet
type: Class
comment: Pallet (pallet) - a shipping container with a rigid wooden platform for cargo. The pallet is designed for storage, transportation, loading and unloading of goods using a forklift truck or a crane with a C-shaped fork. Also called a pallet is one formed cargo unit.
comment: Паллета (поддон) – транспортная тара с жёсткой деревянной площадкой для груза. Паллета предназначена для складирования, перевозки, погрузки и разгрузки товара с помощью вилочного автопогрузчика или крана с С-образным вилочным захватом. Также паллетой называют одну сформированную грузовую единицу. @ru
label: Паллета @ru
subclass of: Conteiner
subclass of: Container
equivalent class: Pallet

Product
type: Class
comment: The concept of "Product" ("Продукт") means any element controlled in the supply chain - a product, packaging, logistics unit, etc. This concept is equivalent to the concept of "Object" ("Объект").
comment: Понятие «Продукт» («Product») означает любой контролируемый элемент в цепи поставок – товар, упаковка, логистическая единица и т.п. Это понятие равнозначно понятию «Объект» («Object»). @ru
label: Продукт @ru
subclass of: Concepts of event recording technology in supply chains based on EPCIS services in accordance with ISO/IEC 19987:2017 Information Technology - EPC Information Services (EPCIS) standard.
equivalent class: Object

ProductBatch/Lot
type: Class
comment: A batch of products is a set of units of homogeneous products produced during a certain period of time in the same conditions and accompanied by one shipping document.
comment: Партия продукции – совокупность единиц однородной продукции, произведенной в течение определенного интервала времени в одних и тех же условиях и сопровождаемой одним товаросопроводительным документом. @ru
label: Партия товара @ru
subclass of: Product
subclass of: Object
equivalent class: ProductBatch

ReadPointID
type: DatatypeProperty
comment: GLN точки считывания данных о событии. @ru
comment: The GLN of the event data readout point.
domain: Location
range: anyURI
sub property of: locationID

SourceDestID
type: DatatypeProperty
comment: GLN "Источника" и " Пункта назначения". @ru
comment: GLN of "Source" and "Destination".
domain: SourceOrDestination
range: anyURI
sub property of: locationID

SourceOrDestination
type: Class
comment: The "source" and "destination" of goods moving through the supply chain are used to provide an additional business context when an EPCIS event is part of a transfer, i.e. a process in which ownership, responsibility and/or storage of physical or digital objects from one participant to another takes place. When describing in an XML document, the template is used: - urn:epcglobal:cbv:sdt:owning_party - urn:epcglobal:cbv:sdt:possessing_party
comment: «Источник» и «Пункт назначения» товара, перемещающегося по цепочке поставок, используются для предоставления дополнительного бизнес-контекста, когда событие EPCIS является частью трансфера, т.е. процесса, в котором происходит передача прав собственности, ответственности и/или хранение физических или цифровых объектов от одного участника к другому. При описании в XML-документе используется шаблон: - urn:epcglobal:cbv:sdt:owning_party - urn:epcglobal:cbv:sdt:possessing_party @ru
label: Источник или Получатель @ru
subclass of: CBV

TradeItem
type: Class
comment: A trade item is an item that is the subject of trade. It is a term used primarily by people in supply chain management and logistic engineering.
comment: Това́р — любая вещь, которая участвует в свободном обмене на другие вещи, продукт, произведённый для продажи и проходящий по цепочке поставок. @ru
label: Торговый элемент @ru
subclass of: Package
equivalent class: TradeItem

TransactionEvent
type: Class
comment: The event type TransactionEvent describes the association or disassociation of physical or digital objects to one or more business transactions. While other event types have an optional bizTransactionList field that may be used to provide context for an event, the TransactionEvent is used to declare in an unequivocal way that certain objects have been associated or disassociated with one or more business transactions as part of the event.
comment: Тип события TransactionEvent описывает привязку или отсоединение физических или цифровых объектов к одной или нескольким бизнес-транзакциям. В то время как другие типы событий имеют необязательное поле bizTransactionList, которое может использоваться для предоставления контекста для события, TransactionEvent используется для однозначного объявления того, что определенные объекты были связаны или разъединены с одной или несколькими бизнес-транзакциями как часть события. @ru
label: Событие по транзакции @ru
subclass of: EPCIS Event

TransformationEvent
type: Class
comment: A TransformationEvent captures information about an event in which one or more physical or digital objects identified by instance-level (EPC) or class-level (EPC Class) identifiers are fully or partially consumed as inputs and one or more objects identified by instance-level (EPC) or class-level (EPC Class) identifiers are produced as outputs. The TransformationEvent captures the relationship between the inputs and the outputs, such that any of the inputs may have contributed in some way to each of the outputs.
comment: TransformationEvent собирает информацию о событии, в котором один или несколько физических или цифровых объектов, идентифицированных идентификаторами уровня экземпляра (EPC) или уровня класса (класс EPC), полностью или частично используются в качестве входных данных, а один или несколько объектов идентифицированы идентификаторами уровня экземпляра. (EPC) или идентификаторы уровня класса (EPC Class) создаются в качестве выходных данных. TransformationEvent фиксирует взаимосвязь между входными и выходными данными, так что любой из входных данных может каким-то образом способствовать каждому из выходных данных. @ru
label: Трансформация @ru
subclass of: EPCIS Event

WHAT
type: Class
comment: Any supply chain object is characterized by the "what" dimension, which includes certain concepts related to URI object(s) identifiers, quantitative parameters, parent and child elements described at the class level.
comment: Любой объект цепочки поставок характеризуется измерением «что (what)», включающий определённые понятия, связанные с идентификаторами объекта (ов) URI, количественными параметрами, родительскими и дочерними элементами, описываемыми на уровне класса. @ru
label: ЧТО @ru
subclass of: Event Dimention
equivalent class: Restriction
  on property: connectedwith
  some values from: Object

WHEN
type: Class
comment: The "WHEN" dimension of EPCIS includes data fields that provide a chronological context of events recorded in supply chains. Fields of this dimension are found in all EPCIS events.
comment: Измерение «WHEN» EPCIS включает поля данных, которые обеспечивают хронологический контекст событий фиксируемых в цепочках поставок. Поля данного измерения встречаются во всех событиях EPCIS. @ru
label: КОГДА @ru
subclass of: Event Dimention

WHERE
type: Class
comment: The "WHERE" dimension determines where the event is fixed – a specific location in the supply chain or a specific reading point. The main measurement fields are the concepts of biz Location and readPoint. The types of reading points and locations are defined in the corresponding CBV dictionaries by the ReadPointID and BusinessLocationID attributes.
comment: Измерение «WHERE» определяет место фиксации события – определённую локацию в цепочке поставок или конкретную точку считывания. В качестве основных полей измерения выступают понятия bizLocation и readPoint. Типы точек считывания и локаций определены в соответствующих словарях CBV атрибутами ReadPointID и BusinessLocationID. @ru
label: ГДЕ @ru
subclass of: Event Dimention
equivalent class: Restriction
  on property: connectedwith
  some values from: Location

WHY
type: Class
comment: The "WHY" dimension includes a complete description of the business context of the event being recorded, defining the fields of the completed business step in the supply chain, the disposition (state) of the object, the type of business transaction associated with the event and the transaction itself, the source of the object movement and the recipient next in the supply chain.
comment: Измерение «WHY» включает полное описания бизнес контекста фиксируемого события, определяя поля выполненного бизнес-шага в цепочке поставок, диспозиции (состояния) объекта, тип связанной с событием бизнес транзакции и самой транзакцией, источник перемещения объекта и получатель, следующий в цепочке поставок. @ru
label: ПОЧЕМУ @ru
subclass of: Event Dimention

action
type: DatatypeProperty
type: NamedIndividual
type: AggregationEvent
type: AssotiationEvent
type: EPCIS Event
type: ObjectEvent
type: TransactionEvent
type: createEventWorldState()
type: richQueryAllEventWorldState()
type: richQueryBlockChain()
type: updateEventWorldState()
type: Restriction
  on property: definedIn
  some values from: AggregationEvent
type: Restriction
  on property: definedIn
  some values from: AssotiationEvent
type: Restriction
  on property: definedIn
  some values from: EPCIS Document
type: Restriction
  on property: definedIn
  some values from: ObjectEvent
type: Restriction
  on property: definedIn
  some values from: TransactionEvent
type: Restriction
  on property: definedIn
  some values from: TransformationEvent
comment: Действия, выполняемые с объектом контроля (ADD, DELETE, OBSERVE). @ru
comment: Actions performed with the control object (ADD, DELETE, OBSERVE).
domain: Class
  union of: AggregationEvent
  union of: AssotiationEvent
  union of: ObjectEvent
  union of: TransactionEvent
range: string
sub property of: wsEventData

bizLocation
type: ObjectProperty
type: NamedIndividual
type: AggregationEvent
type: AssotiationEvent
type: EPCIS Event
type: ObjectEvent
type: TransactionEvent
type: TransformationEvent
type: Restriction
  on property: definedIn
  some values from: AggregationEvent
type: Restriction
  on property: definedIn
  some values from: AssotiationEvent
type: Restriction
  on property: definedIn
  some values from: EPCIS Document
type: Restriction
  on property: definedIn
  some values from: ObjectEvent
type: Restriction
  on property: definedIn
  some values from: TransactionEvent
type: Restriction
  on property: definedIn
  some values from: TransformationEvent
type: Restriction
  on property: definedIn
  some values from: WHERE
comment: (Optional) The business location where the objects associated with the EPCs may be found, until contradicted by a subsequent event.
comment: ((Необязательно) Местоположение предприятия, места считывания данных о событии, где могут быть найдены объекты, связанные с EPCs, до тех пор, пока последующее событие не заменит их. @ru
domain: EPCIS Event
range: Location

bizStep
type: ObjectProperty
type: NamedIndividual
type: AggregationEvent
type: AssotiationEvent
type: EPCIS Event
type: Event Dimention
type: ObjectEvent
type: TransactionEvent
type: TransformationEvent
type: WHY
type: createEventWorldState()
type: richQueryAllEventWorldState()
type: richQueryBlockChain()
type: updateEventWorldState()
type: Restriction
  on property: definedIn
  some values from: AggregationEvent
type: Restriction
  on property: definedIn
  some values from: AssotiationEvent
type: Restriction
  on property: definedIn
  some values from: EPCIS Document
type: Restriction
  on property: definedIn
  some values from: ObjectEvent
type: Restriction
  on property: definedIn
  some values from: TransactionEvent
type: Restriction
  on property: definedIn
  some values from: TransformationEvent
type: Restriction
  on property: definedIn
  some values from: WHY
comment: Бизнес шаг, в котором произошло событие. @ru
comment: The business step of which this event was a part.
domain: EPCIS Event

bizTransactionList
type: NamedIndividual
type: AggregationEvent
type: AssotiationEvent
type: EPCIS Event
type: Event Dimention
type: ObjectEvent
type: TransactionEvent
type: TransformationEvent
type: WHY
type: Restriction
  on property: definedIn
  some values from: AggregationEvent
type: Restriction
  on property: definedIn
  some values from: AssotiationEvent
type: Restriction
  on property: definedIn
  some values from: EPCIS Document
type: Restriction
  on property: definedIn
  some values from: ObjectEvent
type: Restriction
  on property: definedIn
  some values from: TransactionEvent
type: Restriction
  on property: definedIn
  some values from: TransformationEvent
type: Restriction
  on property: definedIn
  some values from: WHY
comment: A list of business transactions related to a specific event.
comment: Список бизнес транзакций, связанных с конкретным событием. @ru

bizTransactionType
type: ObjectProperty
comment: The type of business transaction (EDI message) associated with a fixed event.
comment: Тип бизнес-транзакции (сообщения EDI) связанной с зафиксированным событием. @ru
domain: Business Transaction

certificatiomInfo
type: DatatypeProperty
comment: Trade product certification data reflected in GS1:CertificationDetails format
comment: Сертификационные данные продукта торговли, отраженные в формате GS1:SertificationDetails @ru
domain: EPCIS Event
range: string
sub property of: topDataProperty

certificationInfo
type: NamedIndividual
type: EPCIS Event
type: Restriction
  on property: definedIn
  some values from: EPCIS Event
certificatiom info: gs1:CertificationDetails
comment: Product certification data.
comment: Даные по сертификации продукции. @ru

childEPCs
type: ObjectProperty
type: NamedIndividual
type: AggregationEvent
type: AssotiationEvent
type: EPCIS Event
type: Restriction
  on property: definedIn
  some values from: AggregationEvent
type: Restriction
  on property: definedIn
  some values from: AssotiationEvent
type: Restriction
  on property: definedIn
  some values from: EPCIS Document
type: Restriction
  on property: definedIn
  some values from: ObjectEvent
type: Restriction
  on property: definedIn
  some values from: TransactionEvent
type: Restriction
  on property: definedIn
  some values from: TransformationEvent
type: Restriction
  on property: definedIn
  some values from: WHAT
comment: Неупорядоченный список объектов, содержащихся в упаковке верхнего уровня, идентифицированных идентификаторами уровня экземпляра. AggregationEvent ДОЛЖЕН содержать либо непустой childEPCs, либо непустой childQuantityList, либо и то, и другое, за исключением того, что и childEPCs, и childQuantityList МОГУТ быть пустыми, если выполнено действие DELETE, указывающее, что все дочерние элементы отделены от родительского. AssociationEvent ДОЛЖЕН содержать либо непустой childEPCs, либо непустой childQuantityList, либо и то, и другое, за исключением того, что и childEPCs, и childQuantityList МОГУТ быть пустыми, если выполнено действие DELETE, указывающее, что все дочерние элементы отсоединены от родительского элемента. @ru
comment: An unordered list of the EPCs of contained objects identified by instance-level identifiers. An AggregationEvent SHALL contain either a nonempty childEPCs, a non-empty childQuantityList, or both, except that both childEPCs and childQuantityList MAY be empty if action is DELETE, indicating that all children are disaggregated from the parent. An AssociationEvent SHALL contain either a non-empty childEPCs, a non-empty childQuantityList, or both, except that both childEPCs and childQuantityList MAY be empty if action is DELETE, indicating that all children are disassociated from the parent.
domain: Class
  union of: AggregationEvent
  union of: AssotiationEvent
range: Object

childQuantityList
type: NamedIndividual
type: AggregationEvent
type: AssotiationEvent
type: EPCIS Document
type: EPCIS Event
type: Event Dimention
type: WHAT
comment: A list of products included in the top-level packaging.
comment: Список товаров, включаемых в упаковку верхнего уровня. @ru

connectedwith
type: ObjectProperty
comment: The property of connection with other concepts.
comment: Свойство связи с другими понятиями.(СвязаноС) @ru
domain: Event Dimention
range: Object

definedIn
type: ObjectProperty
comment: The property of defining a specific concept in another concept (Defined In).
comment: Свойство определения конкретного понятия в другом понятии (ОпределеноВ). @ru
domain: Restriction
  on property: definedIn
  some values from: EPCIS Document

destinationList
type: ObjectProperty
type: NamedIndividual
type: AggregationEvent
type: AssotiationEvent
type: EPCIS Document
type: EPCIS Event
type: Event Dimention
type: ObjectEvent
type: TransactionEvent
type: TransformationEvent
type: WHY
comment: Неупорядоченный список элементов назначения (цели продвижения товара по цепочке), который предоставляет контекст о конечной точке завершения бизнес-передачи, частью которой является это событие. @ru
comment: An unordered list of Destination elements that provide context about the terminating endpoint of a business transfer of which this event is a part.
domain: EPCIS Event
range: SourceOrDestination

disposition
type: ObjectProperty
type: NamedIndividual
type: AggregationEvent
type: AssotiationEvent
type: EPCIS Document
type: EPCIS Event
type: Event Dimention
type: ObjectEvent
type: TransactionEvent
type: TransformationEvent
type: WHY
type: createEventWorldState()
type: getALLEventWorldStateByDisposition()
type: richQueryAllEventWorldState()
type: updateEventWorldState()
comment: The disposition or condition of an object at a specific point in the supply chain.
comment: Диспозиция или соточние объекта в конкретной точке цепочки поставок. @ru
domain: EPCIS Event
range: Disposition

epcList
type: ObjectProperty
type: NamedIndividual
type: EPCIS Document
type: EPCIS Event
type: Event Dimention
type: ObjectEvent
type: TransactionEvent
type: WHAT
type: Restriction
  on property: definedIn
  some values from: EPCIS Event
comment: An unordered list of one or more EPCs naming specific objects to which the event pertained.
comment: Неупорядоченный список из одного или нескольких EPC, именующих конкретные объекты, к которым относилось событие. @ru
domain: Class
  union of: ObjectEvent
  union of: TransactionEvent
range: Object

errorDeclaration
type: DatatypeProperty
type: NamedIndividual
type: EPCIS Document
type: EPCIS Event
type: Event Dimention
type: Other fields
error declaration: ErrorDeclaration
comment: Error data in the generated EPCISDocument.
comment: Данные об ошибках в формируемом EPCISDocument. @ru
domain: EPCIS Event
range: string

eventID
type: DatatypeProperty
type: NamedIndividual
type: EPCIS Document
type: EPCIS Event
type: Event Dimention
type: Other fields
comment: Идентификатор события. @ru
comment: Event ID.

eventList
type: ObjectProperty
comment: List of EPCIS events included in a document: connects EPCISDocumentBody to EPCISEvent
comment: Список событий EPCIS, включенных в документ: соединяет EPCISDocumentBody с EPCISEvent.
domain: EPCIS Document
range: EPCIS Event

eventTime
type: ObjectProperty
type: DatatypeProperty
type: NamedIndividual
type: AggregationEvent
type: AssotiationEvent
type: EPCIS Document
type: EPCIS Event
type: Event Dimention
type: ObjectEvent
type: TransactionEvent
type: TransformationEvent
type: WHEN
comment: Время фиксации события. @ru
comment: The time when the event was fixed.
domain: EPCIS Event
range: Restriction
  on data range: dateTimeStamp
  on property: eventTime
  qualified cardinality: 1
range: dateTime
sub property of: EPCIS-CBV-Blockchain TOP OBJECT PROPERTY

eventTimeZoneOffset
type: NamedIndividual
type: AggregationEvent
type: AssotiationEvent
type: EPCIS Document
type: EPCIS Event
type: Event Dimention
type: ObjectEvent
type: TransactionEvent
type: TransformationEvent
type: WHEN
comment: Event Time Zone.
comment: Временная зона фиксации события. @ru

inputEPCList
type: ObjectProperty
type: NamedIndividual
type: EPCIS Document
type: EPCIS Event
type: Event Dimention
type: TransformationEvent
type: WHAT
comment: Input list of EPC object codes for AggregationEvent and AssociationEvent events.
comment: Входной список кодов EPC объектов для событий AggregationEvent и AssociationEvent. @ru
domain: Restriction
  on property: inputEPCList
  some values from: TransformationEvent
range: Restriction
  on property: definedIn
  some values from: TransformationEvent

inputQuantitylist
type: NamedIndividual
type: EPCIS Document
type: EPCIS Event
type: Event Dimention
type: TransformationEvent
type: WHAT
comment: The quantity of goods received at the end of the transformation process. We are fixed in the Transformation Event.
comment: Количество товара, получаемого при окончании процесса трансформации. Фиксируется в TransformationEvent. @ru

locationID
type: DatatypeProperty
comment: Location identifier, reading point. Include: - BusionesslocationID - BusinessStepID - ReadPointID - SourceDestinationID
comment: Идентификатор локации, месторасположения, точки считывания. Включает: - BusionesslocationID - BusinessStepID - ReadPointID - SourceDestinationID @ru

outputEPCList
type: ObjectProperty
type: NamedIndividual
type: EPCIS Document
type: EPCIS Event
type: Event Dimention
type: TransformationEvent
type: WHAT
comment: Выходной список кодов EPC объектов для событий AggregationEvent и AssociationEvent. @ru
comment: Output list of EPC object codes for AggregationEvent and AssociationEvent events.
domain: Restriction
  on property: outputEPCList
  some values from: TransformationEvent
range: Restriction
  on property: definedIn
  some values from: TransformationEvent

outputQuantitylist
type: NamedIndividual
type: EPCIS Document
type: EPCIS Event
type: Event Dimention
type: TransformationEvent
type: WHAT
comment: The output number of objects received when executing the Transformation Event.
comment: Выходное количество объектов, получаемое при выполнении события TransformationEvent. @ru

parentID
type: NamedIndividual
type: AggregationEvent
type: AssotiationEvent
type: EPCIS Document
type: EPCIS Event
type: Event Dimention
type: TransactionEvent
type: WHAT
comment: ID of the parent object.
comment: Идентификатор родительского объекта. @ru

parentId
type: ObjectProperty
comment: (Optional when action is OBSERVE, required otherwise) The identifier of the parent of the aggregation or association. When the parent identifier is an EPC, this field SHALL contain the 'pure identity' URI for the EPC as specified in the GS1 Tag Data Standard
comment: (Необязательно). Идентификатор родительского элемента агрегации или ассоциации. Если родительским идентификатором является EP, это поле должно содержать URI 'pure identity' для EPC, как указано в стандарте данных тегов GS1. @ru
domain: Class
  union of: AggregationEvent
  union of: AssotiationEvent
  union of: TransactionEvent
range: Object

persistentDisposition
type: NamedIndividual
type: AggregationEvent
type: AssotiationEvent
type: EPCIS Document
type: EPCIS Event
type: Event Dimention
type: ObjectEvent
type: TransactionEvent
type: TransformationEvent
type: WHY
comment: Persistent Disposition indicates nontransient business state of an object. New disposition values: available, completeness_verified, completeness_inferred, conformant, container_open, mismatch_instance, mismatch_class, mismatch_quantity, needs replacement, non_conformant, unavailable . Example: an EPCIS event is generated to infer the presence of children still aggregated to their parent (i.e., not yet unpacked nor physically scanned). persistentDisposition = <The identifier that denotes “completeness inferred”>
comment: PersistentDisposition (постоянное расположение) указывает на непереходное бизнес-состояние объекта. Новые значения persistneDisposition: available, completeness_verified, completeness_inferred, container_open, mismatch_instance, mismatch_class, mismatch_quantity, need_to-change, non_conformant, недоступно . Пример: Cобытие EPCIS генерируется для определения наличия дочерних элементов, все еще агрегированных с их родительским элементом (т.е. еще не распакованных и физически не отсканированных). persistentDisposition = <Идентификатор, который обозначает “предполагаемую полноту”> @ru

quantityList
type: NamedIndividual
type: EPCIS Document
type: EPCIS Event
type: Event Dimention
type: ObjectEvent
type: TransactionEvent
type: WHAT
comment: Measurement parameter "WHAT". Describes the number of objects, contains the quantity Value.
comment: Параметр измерения "WHAT". Описывает количество объектов, содержит значение quantityValue. @ru

readPoint
type: ObjectProperty
type: NamedIndividual
type: AggregationEvent
type: AssotiationEvent
type: EPCIS Document
type: EPCIS Event
type: Event Dimention
type: ObjectEvent
type: TransactionEvent
type: TransformationEvent
type: WHAT
type: WHERE
comment: Точка считывания, в которой произошло событие.
comment: The read point at which the event took place.
domain: EPCIS Event
range: Location

recordTime
type: NamedIndividual
type: AggregationEvent
type: AssotiationEvent
type: EPCIS Document
type: EPCIS Event
type: Event Dimention
type: ObjectEvent
type: TransactionEvent
type: TransformationEvent
type: WHEN
type: createEventWorldState()
type: updateEventWorldState()
comment: Measurement parameter "WHEN". Determines the time of event registration.
comment: Параметр измерения "WHEN". Определяет время регистрации события. @ru

sensorElementList
type: NamedIndividual
type: AggregationEvent
type: AssotiationEvent
type: EPCIS Document
type: EPCIS Event
type: Event Dimention
type: HOW
type: ObjectEvent
type: TransactionEvent
type: TransformationEvent
comment: The “how” dimension contains the SensorElementList of one or more SensorElements, which is used to express conditional information about an object or physical location, as captured by associated sensors.
comment: Измерение “как” содержит список элементов SensorElementList одного или нескольких элементов SensorElements, который используется для выражения условной информации об объекте или физическом местоположении, получаемой соответствующими датчиками. @ru

set
type: NamedIndividual
type: EPCIS Event
type: ObjectEvent
comment: persistentDisposition has "set" and "unset" parameters.
comment: persistentDisposition имеет параметры "set" и "unset". @ru

sourceList
type: ObjectProperty
type: NamedIndividual
type: AggregationEvent
type: AssotiationEvent
type: EPCIS Document
type: EPCIS Event
type: Event Dimention
type: ObjectEvent
type: TransactionEvent
type: TransformationEvent
type: WHY
comment: An unordered list of Source elements that provide context about the originating endpoint of a business transfer of which this event is a part.
comment: Неупорядоченный список исходных элементов, которые предоставили контекст о исходной конечной точке бизнес-передачи, частью которой является это событие. @ru
domain: EPCIS Event
range: SourceOrDestination

transformationID
type: NamedIndividual
type: EPCIS Document
type: EPCIS Event
type: Event Dimention
type: Other fields
type: TransformationEvent
comment: In the case of an EPCIS TransformationEvent, an optional TransformationID may be used to link together multiple events that describe the same transformation
comment: В случае события трансформации необязательный transformationID может использоваться для связи нескольких событий, описывающих одно и то же преобразование. @ru

unset
type: NamedIndividual
type: EPCIS Event
type: ObjectEvent
comment: persistentDisposition has "set" and "unset" parameters.
comment: persistentDisposition имеет параметры "set" и "unset". @ru

идентифицированы
type: ObjectProperty
comment: A property indicating that concepts are identified by a specific identifier.
comment: Свойство, указывающее, что понятия идентифицированы конкретным идентификатором. @ru
sub property of: topObjectProperty

указываетНа
type: ObjectProperty
comment: A property that specifies that one concept refers to another.
comment: Свойство, определчющее то, что один концепт указывает на другой. @ru
sub property of: topObjectProperty

Object
type: Class
comment: The concept of "Object" ("Объект"") means any element controlled in the supply chain - a product, packaging, logistics unit, etc. This concept is equivalent to the concept of "Product" ("Продукт").
comment: Понятие "Объект" (Object") подразумевает любой контролируемый в цепочке поставок элемент - товар, упаковку. логистическую единицу и т.д. Данное понятие эквивалентно понятию "Продуукт" ("Product"). @ru
label: Объект @ru
subclass of: Concepts of event recording technology in supply chains based on EPCIS services in accordance with ISO/IEC 19987:2017 Information Technology - EPC Information Services (EPCIS) standard.

Pallet
type: Class
comment: Pallet (pallet) - a shipping container with a rigid wooden platform for cargo. The pallet is designed for storage, transportation, loading and unloading of goods using a forklift truck or a crane with a C-shaped fork. Also called a pallet is one formed cargo unit.
comment: Паллета (поддон) – транспортная тара с жёсткой деревянной площадкой для груза. Паллета предназначена для складирования, перевозки, погрузки и разгрузки товара с помощью вилочного автопогрузчика или крана с С-образным вилочным захватом. Также паллетой называют одну сформированную грузовую единицу. @ru
label: Паллета @ru
subclass of: Conteiner
subclass of: Container

TradeItem
type: Class
comment: A trade item is an item that is the subject of trade. It is a term used primarily by people in supply chain management and logistic engineering.
comment: Това́р — любая вещь, которая участвует в свободном обмене на другие вещи, продукт, произведённый для продажи и проходящий по цепочке поставок. @ru
label: Товар @ru
subclass of: Package

Package
type: Class
comment: A product intended for the placement, protection, movement, delivery, storage, transportation and display of goods (raw materials and finished products), used both by the manufacturer, user or consumer, and by the processor, assembler or other intermediary
comment: Изделие, предназначенное для размещения, защиты, перемещения, доставки, хранения, транспортирования и демонстрации товаров (сырья и готовой продукции), используемое как производителем, пользователем или потребителем, так и переработчиком, сборщиком или иным посредником @ru
label: Упаковка @ru
subclass of: Pallet

Brand
type: Class
entity position:
  entity position x: 189.9325130100376
  entity position y: 132.23490614709402
  comment: This is an entity positioning annotation generated by CoModIDE (https://comodide.com/). Removing this annotation will break rendering the CoModIDE schema diagram view.
spesialaizes: Brand
comment: Information on brands and sub-brands for a product.
comment: Указывает бренд и суббренд товара @ru
label: Бренд @ru
subclass of: CBV

Organization
type: Class
entity position:
  entity position x: 88.51128957922374
  entity position y: 74.52429896078793
  comment: This is an entity positioning annotation generated by CoModIDE (https://comodide.com/). Removing this annotation will break rendering the CoModIDE schema diagram view.
spesialaizes: schema Organization
comment: Organization
comment: An Organization is any legal or physical entity involved at any point in any supply chain and upon which there is a need to retrieve predefined information. An Organization is uniquely identified by a Global Location Number (GLN). Detail description - http://gs1.org/voc/Organization
comment: Организация — это любое юридическое или физическое лицо, участвующее в любой точке любой цепочки поставок и у которого есть необходимость в получении предварительно определенной информации. Организация однозначно идентифицируется глобальным номером местонахождения (GLN). Детальное описание - http://gs1.org/voc/Organization @ru
label: Организация @ru
subclass of: Concepts of event recording technology in supply chains based on EPCIS services in accordance with ISO/IEC 19987:2017 Information Technology - EPC Information Services (EPCIS) standard.

Place
type: Class
entity position:
  entity position x: 66.73257299271411
  entity position y: 157.76291563821772
  comment: This is an entity positioning annotation generated by CoModIDE (https://comodide.com/). Removing this annotation will break rendering the CoModIDE schema diagram view.
spesialaizes: Place
comment: Entities that have a somewhat fixed, physical location.
comment: Сущности, которые имеют одно или несколько фиксированных физических местоположений (location). @ru
label: Место @ru
subclass of: CBV

Product
type: Class
entity position:
  entity position x: 153.1553202535723
  entity position y: 78.62295614067087
  comment: This is an entity positioning annotation generated by CoModIDE (https://comodide.com/). Removing this annotation will break rendering the CoModIDE schema diagram view.
spesialaizes: Product
comment: Any item (product or service) upon which there is a need to retrieve pre-defined information and that may be priced, or ordered, or invoiced at any point in any supply chain.
comment: Любой товар (продукт или услуга), по которому необходимо получить предварительно определенную информацию и который может быть оценен, заказан или выставлен счет в любой точке любой цепочки поставок. @ru
label: Продукт @ru
subclass of: Concepts of event recording technology in supply chains based on EPCIS services in accordance with ISO/IEC 19987:2017 Information Technology - EPC Information Services (EPCIS) standard.

Batch/Lot Identifier
type: DatatypeProperty
type: FunctionalProperty
entity position:
  entity position x: 230.13650458611124
  entity position y: 610.4604950467346
  comment: This is an entity positioning annotation generated by CoModIDE (https://comodide.com/). Removing this annotation will break rendering the CoModIDE schema diagram view.
comment: Номер партии или партии связывает njdfh с информацией, которую производитель считает важной для прослеживаемости предмета торговли, к которому применяется строка элемента. Данные могут относиться к самому njdfhe или к содержащимся в нем предметам. Номер может быть, например, номером производственной партии, номером смены, номером машины, временем или внутренним производственным кодом. В случаях, когда один и тот же продукт производится в разных местах, владелец торговой марки и производитель несут ответственность за отсутствие дублирования номеров партий/лотов для номера GTIN. Для повторного использования номеров партий/лотов с номером GTIN необходимо учитывать отраслевые ограничения. @ru
domain: Product
domain: Restriction
  on property: Batch/Lot Identifier
  some values from: Product
label: The batch or lot number associates an item with information the manufacturer considers relevant for traceability of the trade item to which the element string is applied. The data may refer to the trade item itself or to items contained. The number may be, for example, a production lot number, a shift number, a machine number, a time, or an internal production code. In cases where the same product is manufactured in different locations the brand owner and the manufacturer are responsible for ensuring the non-duplication of batch/lot numbers for a GTIN. For the re-use of batch/lot numbers with a GTIN, sector-specific constraints need to be considered.
range: string

Brand nave
type: DatatypeProperty
comment: The brand name of the product that appears on the consumer package.
comment: Торговая марка продукта, указанная на потребительской упаковке. @ru
domain: Brand
range: langString

Functiona lName
type: DatatypeProperty
type: FunctionalProperty
entity position:
  entity position x: 390.4559632497195
  entity position y: 489.88620432690516
  comment: This is an entity positioning annotation generated by CoModIDE (https://comodide.com/). Removing this annotation will break rendering the CoModIDE schema diagram view.
comment: Describes use of the product or service by the consumer. Should help clarify the product classification associated with the GTIN.
comment: Описывает использование продукта или услуги потребителем. Должен помочь уточнить классификацию товаров, связанную с номером GTIN. @ru
domain: Product
range: langString

vocglobalLocationNumber
type: DatatypeProperty
type: FunctionalProperty
spesialaizes: globalLocationNumber
comment: A Global Location Number (GLN) is the GS1 Identification Key used to identify physical locations or parties. The key comprises a GS1 Company Prefix, Location Reference and Check Digit. For more information see https://www.gs1.org/gln.
comment: Global Location Number (GLN)
comment: Глобальный номер местоположения (GLN) — это идентификационный ключ GS1, используемый для идентификации физических местоположений или сторон. Ключ состоит из префикса компании GS1, ссылки на местоположение и контрольной цифры. Для получения дополнительной информации см. https://www.gs1.org/gln. @ru
domain: Class
  union of: Organization
  union of: Place
range: string

GPC Category Code
type: DatatypeProperty
type: FunctionalProperty
entity position:
  entity position x: 109.75626484617746
  entity position y: 570.3939907514631
  comment: This is an entity positioning annotation generated by CoModIDE (https://comodide.com/). Removing this annotation will break rendering the CoModIDE schema diagram view.
comment: 8-digit code (GPC Brick Value) specifying a product category according to the GS1 Global Product Classification (GPC) standard. For more information see https://www.gs1.org/gpc
comment: 8-значный код (GPC Brick Value), определяющий категорию продукта в соответствии со стандартом GS1 Global Product Classification (GPC). Для получения дополнительной информации см. https://www.gs1.org/gpc @ru
domain: Product
range: langString

GPC Category Description
type: DatatypeProperty
type: FunctionalProperty
entity position:
  entity position x: 39.559763602770715
  entity position y: 489.6124286044238
  comment: This is an entity positioning annotation generated by CoModIDE (https://comodide.com/). Removing this annotation will break rendering the CoModIDE schema diagram view.
comment: A description of the code specifying a product category according to the GS1 Global Product Classification (GPC) standard.
comment: Описание кода, определяющего категорию продукта в соответствии со стандартом GS1 Global Product Classification (GPC). @ru
domain: Product
range: langString

GTIN
type: DatatypeProperty
type: FunctionalProperty
entity position:
  entity position x: 9.551387939244933
  entity position y: 430.4862206086227
  comment: This is an entity positioning annotation generated by CoModIDE (https://comodide.com/). Removing this annotation will break rendering the CoModIDE schema diagram view.
spesialaizes: gtin13
spesialaizes: gtin14
spesialaizes: gtin8
comment: A Global Trade Item Number (GTIN) is the 14 digit GS1 Identification Key used to identify products. The key comprises a GS1 Company Prefix followed by an Item Reference Number and a Check Digit. See https://www.gs1.org/gtin for more details.
comment: Глобальный номер предмета торговли (GTIN) — это 14-значный идентификационный ключ GS1, используемый для идентификации товаров. Ключ состоит из префикса компании GS1, за которым следуют справочный номер товара и контрольная цифра. См. https://www.gs1.org/gtin для более подробной информации. @ru
domain: Product
range: string

Batch/Lot Identifier
type: ObjectProperty
comment: The batch or lot number associates an item with information the manufacturer considers relevant for traceability of the trade item to which the element string is applied. The data may refer to the trade item itself or to items contained. The number may be, for example, a production lot number, a shift number, a machine number, a time, or an internal production code. In cases where the same product is manufactured in different locations the brand owner and the manufacturer are responsible for ensuring the non-duplication of batch/lot numbers for a GTIN. For the re-use of batch/lot numbers with a GTIN, sector-specific constraints need to be considered.
comment: Номер партии или партии связывает предмет с информацией, которую производитель считает важной для прослеживаемости предмета торговли, к которому применяется строка элемента. Данные могут относиться к самому предмету торговли или к содержащимся в нем предметам. Номер может быть, например, номером производственной партии, номером смены, номером машины, временем или внутренним производственным кодом. В случаях, когда один и тот же продукт производится в разных местах, владелец торговой марки и производитель несут ответственность за отсутствие дублирования номеров партий/лотов для номера GTIN. Для повторного использования номеров партий/лотов с номером GTIN необходимо учитывать отраслевые ограничения. @ru
domain: Product
range: Product
range: Restriction
  on property: Batch/Lot Identifier
  some values from: string

Serial Number
type: ObjectProperty
comment: A serial number is assigned to an entity for its lifetime. When combined with a GTIN, a serial number uniquely identifies an individual item. The serial number field is alphanumeric and may include all characters contained in figure 7.11-1. The brand owner and the manufacturer are responsible for ensuring the non-duplication of serial numbers for a GTIN. For the re-use of serial numbers with a GTIN, sector-specific constraints need to be considered.
comment: Серийный номер присваивается объекту на весь срок его службы. В сочетании с GTIN серийный номер однозначно идентифицирует отдельный товар. Поле серийного номера является буквенно-цифровым и может включать все символы, указанные на рис. 7.11-1. Владелец торговой марки и производитель несут ответственность за недопущение дублирования серийных номеров GTIN. Для повторного использования серийных номеров с GTIN необходимо учитывать отраслевые ограничения. @ru
domain: Product
range: Product
range: Restriction
  on property: Serial Number
  some values from: string

Has Location
type: ObjectProperty
type: FunctionalProperty
type: InverseFunctionalProperty
spesialaizes: location
comment: The place associated with an organization.
comment: Месторасположение, связанное с организацией @ru
domain: Organization
range: Place

vocproductName
type: DatatypeProperty
type: FunctionalProperty
entity position:
  entity position x: 340.001484581331
  entity position y: 560.2682012344503
  comment: This is an entity positioning annotation generated by CoModIDE (https://comodide.com/). Removing this annotation will break rendering the CoModIDE schema diagram view.
comment: Consumer friendly short description of the product suitable for compact presentation.
comment: Удобное для потребителя краткое описание продукта, подходящее для компактной презентации. @ru
domain: Product
range: langString

Serial Number
type: DatatypeProperty
type: FunctionalProperty
entity position:
  entity position x: 489.6891996996603
  entity position y: 439.6161195737578
  comment: This is an entity positioning annotation generated by CoModIDE (https://comodide.com/). Removing this annotation will break rendering the CoModIDE schema diagram view.
comment: A serial number is assigned to an entity for its lifetime. When combined with a GTIN, a serial number uniquely identifies an individual item. The serial number field is alphanumeric and may include all characters contained in figure 7.11-1. The brand owner and the manufacturer are responsible for ensuring the non-duplication of serial numbers for a GTIN. For the re-use of serial numbers with a GTIN, sector-specific constraints need to be considered.
comment: Серийный номер присваивается объекту на весь срок его службы. В сочетании с GTIN серийный номер однозначно идентифицирует отдельный товар. Поле серийного номера является буквенно-цифровым и может включать все символы, указанные на рис. 7.11-1. Владелец торговой марки и производитель несут ответственность за недопущение дублирования серийных номеров GTIN. Для повторного использования серийных номеров с GTIN необходимо учитывать отраслевые ограничения. @ru
domain: Product
domain: Restriction
  on property: Serial Number
  some values from: Product
range: string

Sub-brand Name
type: DatatypeProperty
comment: Second level of brand. Can be a trademark. It is the primary differentiating factor that a brand owner wants to communicate to the consumer or buyer. E.g. Yummy-Cola Classic. In this example Yummy-Cola is the brand and Classic is the sub-brand.
comment: Второй уровень бренда. Может быть торговой маркой. Это основной отличительный фактор, который владелец бренда хочет сообщить потребителю или покупателю. Например. Вкуснятина-Кола Классик. В этом примере Yummy-Cola — бренд, а Classic — суббренд. @ru
domain: Brand
range: langString

schema Organization
label: Схема организации @ru

Supply Chain Ontology
type: Ontology
contributor: Центр Систем Идентификации Национальной академии Республики Беларусь http://www.ids.by @ru
contributor: ID Center Republic of Belarus http://www.ids.by
creator: Александр Агафонов @ru
creator: Alexander Agafonov
description: Онтология цепочек поставок, включает определение понятий, определений, терминов, применяемых в цепочках поставок на основе стандарта ISO/IEC 19987:2017 Information technology — EPC Information Services (EPCIS) Standard и рекомендации GS1 по модели событий EPCIS Event Model (EEM); @ru
description: Ontology of supply chains, including the definition of concepts, definitions, terms used in supply chains based on the - ISO / IEC 19987: 2017 Information technology - EPC Information Services (EPCIS) Standard - GS1 recommendations for the EPCIS Event Model (EEM);
last modified: 2022-09-12T 17:20:00
title: Онтология цепочек поставки @ru
created: 2022-09-01 @ru
modified: 2021-09-30
preferred namespace prefix: cbv
preferred namespace uri: https://ns.gs1.org/cbv/
spesialaizes: schema.org
comment: Онтология EPCIS+CBV+Blockchain для цепочек поставок @ru
comment: Пространство имён http://gs1.org/voc - общий словарь понятий Ассоциации автоматической идентификации GS1. В онтологии введён префикс данного словаря - gs1. Все понятия, имеющие данный префикс определены изначально в глобальном словаре GS1. @ru
comment: The Comprehensive Business Vocabulary defines various enumerations used by EPCIS. http^//www.gs1/org/voc
comment: Онтология цепочек поставки использует описания W3C RDF Schema и WEB Ontology Language. Онтология использует определённые понятия словаря GS1 (https://www.gs1.org/voc) @ru
comment: Привязка к Dublin Core: 1. Добавка префикса в "подвал" для связки метаданных DC 2. В Annotation Properties - необходимые метаданные: title, creator, description, publisher, contributor date, identifier, lastModified. Link на понятия DC - http://purl.org/dc/elements/1.1/ @ru
comment: Основные классы, заимствованные из глобального словаря GS1 (http://gs1.org/voc) следующие: 1-Organisation 2-Place 3-Brand 4-Product @ru
comment: Supply Chain Ontology describet using W3C RDF Schema and WEB Ontology Language. This Ontology builds on a refers to GS1 Vocabulary (https://www.gs1.org/voc).
version IRI: EPCIS-CBV-Blockchain-1.0
version info: 2.0

ACL
type: Class
comment: ACL, or Access Control List, assigns access to certain peer resources (such as system chaincode APIs or event services) through Policy - access policy (it determines the number and types of organizations and roles to which access is granted).
comment: ACL, или Access Control List, назначает доступ к определенным ресурсам пиров (таким как API-интерфейсы системного чейнкода или событийные службы) через Policy - политику доступа (она определяет количество и типы организаций и ролей, которым предоставляется доступ). @ru
subclass of: Blockchain
equivalent class: Class
  intersection of: Restriction
    on property: определение доступа
    some values from: HLF_PEERS
  intersection of: Restriction
    on property: определение доступа
    some values from: API

Anchor peer
type: Class
comment: A node used by the gossip protocol to connect peers from different organizations and to discover other peers.
comment: Узел, используемый gossip-протоколом, чтобы соединять пиры разных организаций и для обнаружения других пиров. @ru
label: Anchor-пир @ru
subclass of: HLF_PEERS
equivalent class: Restriction
  on property: объединяет
  some values from: HLF_PEERS

Application
type: Class
comment: Any application or component of an accounting system that works for supply chain management.
comment: Любое приложение или компонент учётной системы, работающей для управления цепочкой поставок. @ru
label: Приложение @ru
subclass of: Blockchain
equivalent class: Restriction
  on property: определяет данные для TX
  some values from: API
equivalent class: Restriction
  on property: управляет
  some values from: Supply chain
equivalent class: Restriction
  on property: реализует
  some values from: API

Block
type: Class
comment: A block contains an ordered set of transactions. It is cryptographically tied to the previous block and is also linked to subsequent blocks. The first block in the block chain is called the genesis block. Blocks are created by the ordering service, and then validated and entered into the registry by peers.
comment: Блок содержит упорядоченный набор транзакций. Он криптографически привязан к предыдущему блоку, а также связан с последующими блоками. Первый блок в цепи блоков называется genesis-блоком. Блоки создаются ordering-службой, а потом валидируются и вносятся в реестр пирами. @ru
label: Блок @ru
subclass of: Block chain

Block chain
type: Class
comment: A chain of interconnected registry blocks.
comment: Цепочка взаимосвязанных блоков реестра. @ru
label: Цепочка блоков @ru
subclass of: Registry

HLF_PEERS
type: Class
comment: Peer nodes that are part of the blockchain network.
comment: Одноранговые узлы, входящие в состав сети блокчейн. @ru
label: HLF_Узлы @ru
subclass of: Blockchain

CA
type: Class
comment: Hyperledger Fabric CA is a standard CA (certification authority) component that issues Public Key Infrastructure (PKI) certificates to network participants and their users. The CA issues one root certificate (rootCert) to each participant and one enrollment certificate (ECert, enrollment) to each authorized user.
comment: Hyperledger Fabric CA — стандартный CA (сертификационный центр) компонент, который выдает сертификаты инфраструктуры публичных ключей (Public Key Infrastructure, PKI) участниками сети и их пользователям. CA выдает один корневой сертификат (rootCert) каждому участнику и один enrollment-сертификат (ECert, enrollment — зачисление) каждому авторизованному пользователю. @ru
label: СЦ @ru
subclass of: HLF_PEERS
equivalent class: Restriction
  on property: выдаёт сертификаты
  some values from: Organization
equivalent class: Restriction
  on property: выдаёт сертификаты
  some values from: HLF_PEERS

CBV
type: Class
comment: The concepts of CBV (Core Business Vocabulary) reference books and from the relationship with the EPCIS event apparatus based on the ISO/IEC 19988:2017 Information technology — Core Business Vocabulary Standard.
comment: Понятия справочников CBV (Core Business Vocabulary) и из взаимосвязи с событийным аппаратом EPCIS на основании стандарта стандарта ISO/IEC 19988:2017 Information technology — Core Business Vocabulary Standard. @ru

Chaincode
type: Class
comment: A package containing one or more Smart Contracts. Chaincode is installed on all active nodes of the blockchain network and initiated on them.
comment: Пакет, содержащий один или несколько Smart-контрактов. Чейнкод инсталируется на всех активных узлах сети блокчейн и инициируется на них. @ru
label: Чейнкод @ru
subclass of: Blockchain
equivalent class: Restriction
  on property: включает
  some values from: Smart-contract

Channel
type: Class
comment: A channel is a private blockchain overlay that provides isolation and privacy. The channel registry is shared among channel peers, and transaction parties must be authenticated in the channel in order to interact with it.
comment: Канал — это приватный блокчейн-оверлей, обеспечивающий изоляцию и конфиденциальность. Реестр канала распространен между пирами канала, и стороны транзакций должны быть аутентифицированы в канале для взаимодействий с ним. @ru
label: Канал @ru
subclass of: Blockchain

Committing
type: Class
comment: They check the approval of transactions, the results of their execution and place the block in the registry. These nodes are responsible for: - for adding a block to the registry; - for updating the World State; - may contain smart contracts (but this is not required);
comment: Проверяют одобрение транзакций, результаты их выполнения и помещают блок в реестр. Данные узлы ответственны: - за добавление блока в реестр; - за обновление World State; - могут содержать smart контракты (но это не обязательно); @ru
label: Коммотер @ru
subclass of: HLF_PEERS
equivalent class: Restriction
  on property: добавление блока
  some values from: Block chain
equivalent class: Restriction
  on property: обновление WS
  some values from: WS database

Consensus
type: Class
comment: Consensus is a concept that covers the entire transaction flow, serving to create agreement on the order of transactions and their correctness. This agreement forms a block. Hyperledger Fabric implements the following consensus algorithms: - SOLO for temting, one Orderer; - KAFKA this algorithm is effective for a ready-made functioning solution and is used for real-time systems; - RAFT is a distributed consensus algorithm that is used so that several participants can jointly decide whether an event happened or not, and what followed; -SBFT (Byzantine generals algorithm) - the most effective in terms of fault tolerance and eliminates 90% of the work of incorrect nodes;
comment: Консенсус - понятие, охватывающее весь транзакционный поток, служащий для того, чтобы создать согласие на порядок транзакций и их корректность. Это согласие образует блок. Hyperledger Fabric реализует следующие алгоритмы консенсуса: - SOLO для теcтирования, один Orderer; - KAFKA данный алгоритм эффективен для готового функционирующего решения и применяется для систем, функционирующих в режиме реального времени; - RAFT – алгоритм распределённого консенсуса, который используется для того, чтобы несколько участников могли совместно решить, произошло ли событие или нет, и что за чем следовало. RAFT работает на основе лидерства. -SBFT (алгоритм византийских генералов) -наиболее эффективен в части отказоустойчивости и исключает на 90% работу некорректных узлов; @ru
label: Консенсус @ru
subclass of: Blockchain

Consortium
type: Class
comment: Consortium - a collection of blockchain network organizations. These organizations can form channels. While a blockchain network can have multiple consortiums, most blockchain networks only have one. During channel creation, all organizations added to the channel must be part of the same consortium. However, an organization not defined in the consortium can be added to an existing channel.
comment: Консорциум (Consortium) - коллекция из организаций блокчейн-сети. Эти организации могут образовывать каналы. Хотя блокчейн-сеть может иметь несколько консорциумов, большинство блокчейн сетей имеют только один. Во время создания канала, все организации, добавленные в канал, должны быть частью одного консорциума. Однако организация, не определенная в консорциуме, может быть добавлена в существующий канал. @ru
label: Консорциум @ru
subclass of: Blockchain

Concepts of event recording technology in supply chains based on EPCIS services in accordance with ISO/IEC 19987:2017 Information Technology - EPC Information Services (EPCIS) standard.
type: Class
label: EPCIS
label: Понятия технологии фиксации событий в цепочках поставок на основе EPCIS сервисов в соответствии со стандартом ISO/IEC 19987:2017 Information technology — EPC Information Services (EPCIS) Standard. @ru

Endorserer
type: Class
comment: A group of nodes that perform a chaincode transaction and return a proposal response to the client application. The proposed response includes the result of the chaincode, read set and write set, events and a signature that serves as proof that the peer executed the chaincode. Chaincode applications have corresponding confirmation policies that specify the confirming peers.
comment: Группа узлов, выполняющих чейнкод-транзакцию и возвращающий proposal response (ответ на предложение о транзакции) клиентскому приложению. Proposal response включает в себя результат работы чейнкода, read set и write set, события и подпись, служащую доказательством того, что пир выполнил чейнкод. Чейнкод-приложения имеют соответствующие политики подтверждения, в которых указаны подтверждающие пиры. @ru
label: Подтверждающий узел @ru
subclass of: HLF_PEERS
equivalent class: Restriction
  on property: выполнение
  some values from: Smart-contract

Gossip protocol
type: Class
comment: Gossip data distribution protocol (broadcast): 1) manages the discovery of peers (peer discovery) 2) manages the channel membership; 3) distributes registry data among all channel peers; 4) synchronizes the registry state of all channel peers.
comment: Gossip-протокол распределения данных (широковещательное оповещение): 1) заведует обнаружением пиров (peer discovery) 2) заведует составом канала (channel membership); 3) распределяет данные реестра по всем пирам канала; 4) синхронизирует состояние реестра всех пиров канала. @ru
label: Gissip-протокол @ru
subclass of: Blockchain

Key
type: Class
comment: The key of an entry in the World State database that identifies the current state of the object.
comment: Ключ записи в базе World State, идентифицирующий текущее состояние объекта. @ru
label: Ключ @ru
subclass of: WS database

MSP
type: Class
comment: A component of the HL Fabric system that provides identities to users and peers so that they can participate in the Fabric network. Clients use these identities to authenticate their transactions, and peers use these to authenticate the results of transaction processing (confirmations).
comment: Компонент системы HL Fabric, поставляющий удостоверения пользователям и пирам, чтобы они могли участвовать в сети Fabric. Клиенты используют эти удостоверения для аутентификации своих транзакций, а пиры - для аутентификации результатов обработки транзакций (подтверждений). @ru
subclass of: HLF_PEERS

Orderer Services
type: Class
comment: One or more nodes that organizes transactions into blocks and then distributes the blocks to peers for validation and storage. The ordering service does not depend on peers and orders transactions on a first-come-first-serve basis (the earlier a transaction arrives, the faster it will be processed).
comment: Один или более узлов, упорядочивающих транзакции в блоки, а затем распространяющий блоки пирам для проверки и сохранения. Ордеринг-служба не зависит от пиров и упорядочивает транзакции по принципу first-come-first-serve (чем раньше транзакция поступает, тем быстрее ее обработают). @ru
label: Orderer служба @ru
subclass of: HLF_PEERS
equivalent class: Class
  intersection of: Restriction
    on property: распространение
    some values from: Block
  intersection of: Restriction
    on property: формирование
    some values from: Block
equivalent class: Restriction
  on property: упорядочивание
  some values from: Transaction

Supply chain
type: Class
comment: Цепочка поставок определяет трассу движения контролируемых товарных потоков по определённым бизнес-шагам. @ru
label: The supply chain determines the route of movement of controlled commodity flows along certain business steps.
label: Цепочка поставок @ru
subclass of: Concepts of event recording technology in supply chains based on EPCIS services in accordance with ISO/IEC 19987:2017 Information Technology - EPC Information Services (EPCIS) standard.

TXId
type: NamedIndividual
type: getBlockNumber()
comment: Transaction ID. Used in the context of a request for transaction data from the blockchain registry.
comment: Идентификатор транзакции. Используется в контексте запроса на данные о транзакции из реестра блокчейн. @ru

Transaction
type: Class
comment: An atomic unit of a blockchain that is part of a block. One or more transactions are recorded in one block. Transactions are created when the client calls the cheyncode. Application clients must collect a set of Endorsements from several peers to their Proposal, and then (optionally) send the result to an order, after which the transaction will fall into a block and be distributed in this block to channel peers and saved to a copy of the registry on each peer.
comment: Атомарная единица блокчейн, входящая в блок. В одном блоке фиксируется одна и более транзакций. Транзакции создаются, когда клиент вызывает чейнкод. Клиенты приложений должны собрать набор Endorsement от нескольких пиров на свой Proposal, а потом (опционально) отослать результат на ордеринг, после чего транзакция попадет в блок и будет распределена в этом блоке на пиры канала и сохранена в копию реестра на каждом пире. @ru
label: Транзакция @ru
subclass of: Block

Transaction Log
type: Class
comment: Log of all transactions generated by clients in the system
comment: Журнал всех транзакций, сформированных клиентами в системе @ru
label: Журнал транзакций @ru
subclass of: Blockchain

Value
type: Class
comment: Value - a set of parameters passed to fix the current state in the World State database. In terms of Hyperledger Fabric, a "useful load" is called, the presence of which is mandatory for fixing states and registering a transaction in a block.
comment: Значение - набор параметров, передаваемых для фиксации текущего состяния в базе World State. В терминах Hyperledger Fabric называется "полезная нагрузка", наличие которой обязательно для фиксации состояний и регистрации транзакции в блоке. @ru
label: Значение @ru
subclass of: WS database

dateEnd
type: NamedIndividual
type: richQueryAllEventWorldState()
type: richQueryBlockChain()
comment: The time when the IoT sensor completed the measurement.
comment: Время завершения измерения датчиком IoT. @ru

dateStart
type: NamedIndividual
type: richQueryAllEventWorldState()
type: richQueryBlockChain()
comment: The start date of the measurement by the IoT equipment.
comment: Дата начала измерения оборудованием IoT. @ru

epc
type: NamedIndividual
type: createEventWorldState()
type: deleteEventWorldState()
type: existEventWorldState()
type: getALLEventWorldStateByDisposition()
type: getAllEventTransactionBlockChainByEpc()
type: readEventWorldState()
type: richQueryAllEventWorldState()
type: richQueryBlockChain()
type: updateEventWorldState()
comment: Electrunic Product Code.
comment: Электронный код продукта. @ru

eventType
type: NamedIndividual
type: createEventWorldState()
type: richQueryAllEventWorldState()
type: richQueryBlockChain()
type: updateEventWorldState()
comment: The type of event recorded in the supply chain.
comment: Тип события, фиксируемого в цепочке поставок. @ru

hashOfEPCISDocument
type: NamedIndividual
type: createEventWorldState()
type: updateEventWorldState()
comment: HASH of the EPCISDocument content for the event recorded in the EPCIS repository.
comment: HASH содержимого EPCISDocument для события, зафиксированного в репозитарии EPCIS. @ru

linkToEPCISDocument
type: NamedIndividual
type: createEventWorldState()
type: updateEventWorldState()
comment: Cсылка на EPCISDocument в репозитарии EPCIS. @ru
comment: The link to the EPC IS Document in the EPCIS repository.

sgln
type: NamedIndividual
type: createEventWorldState()
type: richQueryAllEventWorldState()
type: richQueryBlockChain()
type: updateEventWorldState()
comment: Serialized GLN (GS1 EPCglobal standard).
comment: Сериализованный GLN локации (стандарт GS1 EPCGlobal). @ru

включает
type: ObjectProperty
comment: A property indicating that an object "includes" another object.
comment: Свойство, указывающее, что объект "включает" другой объект. @ru

выдаёт сертификаты
type: ObjectProperty
comment: The property of issuing a certificate by an MSP node for Hyperledger Fabric network members.
comment: Свойство выдачи сертификата узлом MSP для участников сети Hyperledger Fabric. @ru

выполнение
type: ObjectProperty
comment: A property that defines the execution of a certain action.
comment: Свойство, определяющее выполнении определённого действия. @ru

добавление блока
type: ObjectProperty
comment: A property that defines an operation to add a transaction block to the Hyperledger Fabric registry.
comment: Свойство, определяющее операцию по добавлению блока транзакций в реестр Hyperledger Fabric. @ru
sub property of: topObjectProperty

запрос на фиксациют состояния вWS
type: ObjectProperty
comment: A property that reflects a request to commit states to the World State.
comment: Свойство, отражающее запрос на фиксацию состояний в World State. @ru

обновление WS
type: ObjectProperty
comment: A property that defines the operation of updating a record in the World State database.
comment: Свойство, определяющее операцию обновления записи в базе состояний World State. @ru
sub property of: topObjectProperty

объединяет
type: ObjectProperty
comment: A property that defines the union of related concepts.
comment: Свойство, определяющее объединение связываемых понятий. @ru

определение доступа
type: ObjectProperty
comment: The property of defining access for specific concepts.
comment: Свойство определения доступа для конктретных концептов. @ru

определяет данные для TX
type: ObjectProperty
comment: A property that reflects the procedure for preparing data (context) for forming a transaction offer at the API level of the accounting system.
comment: Свойство, отражающее процедуру подготовки данных (контекста) для формирования предложения транзакции на уровне API учётной системы. @ru

распространение
type: ObjectProperty
comment: A property that reflects a broadcast alert. Events on which information is broadcast across the nodes of the blockchain network^ 1- Contract events - Those emitted explicitly by the chaincode developer within a transaction 2- Transaction (Commit) events - Those emitted automatically when a transaction is committed after an invoke 3- Block events - Those emitted automatically when a block is committed
comment: Свойство, отражающее широковещательное оповещение по узлам сети блокчейн по следующим событиям в сети: 1- Контрактные события — те, которые явно создаются разработчиком чейнкода в рамках транзакции. 2- События транзакций (фиксации) — автоматически генерируются, когда транзакция фиксируется после вызова. 3- Блоковые события — автоматически генерируются при фиксации блока. @ru

упорядочивание
type: ObjectProperty
comment: Ordering property. In the context of the ontology, we mean ordering the Ordered Service by the node into a block in chronological order received in the process of processing transactions. Logical statement: Orderer EquivalentTo упорядочивание some Transaction
comment: Свойство упорядочивания. В контекте онтологии имеется ввиду упорядочивание Ordered Service узлом получаемых в процессе обработки транзакций в блок в хронологическом порядке. Логическое утверждение: Orderer EquivalentTo упорядочивание some Transaction @ru

управляет
type: ObjectProperty
comment: A property that reflects the fact of control - one concept controls another. Logic statement example: Application EquivalentTo управляет some Supply_chain
comment: Свойство, отражающее факт управления - один концепт управляет другим. Пример логического утверждения: Application EquivalentTo управляет some Supply_chain @ru

формирование
type: ObjectProperty
comment: Data generation event by the specified concept. Logic statement example: Orderer EquivalentTo (распространение some Block) and (формирование some Block) @ru
comment: Событие формирования данных указанным концептом. Пример логического утверждения: Orderer EquivalentTo (распространение some Block) and (формирование some Block) @ru

API
type: Class
comment: Accounting System Application Programming Interface (API). The main function of the API is to prepare the context of the data to be fixed in the distributed registry.
comment: Прикладной программный интерфей учётной системы (API). Основная функцияя API - подготовка контекта данных, подлежащих фиксации в распределённом реестре. @ru
subclass of: Blockchain
equivalent class: Restriction
  on property: предлагает Tx
  some values from: Smart-contract

Blockchain
type: Class
comment: Concepts of blockchain technology for the application of the Hyperledger Fabric platform, taking into account the registration in the distributed registry of data on events in supply chains based on EPCIS and CBV.
comment: Понятия технологии блокчейн для применения платформы Hyperledger Fabric, с учётом регистрации в распределённом реестре данных по событиям в цепочках поставок на основе EPCIS и CBV. @ru
label: Блокчейн @ru

HLF_SDK
type: Class
comment: Java SDK that provides interaction of applications and smart contracts with the blockchain network. The main features of the SDK are placing transactions in the registry or making requests to the registry to obtain the necessary transaction data.
comment: Java SDK, который позволяет приложениям и смарт-контрактам взаимодействовать с сетью блокчейн. Основными возможностями SDK являются размещение транзакций в реестре или выполнение запросов к реестру для получения необходимых данных о транзакциях. @ru
subclass of: Blockchain
equivalent class: Restriction
  on property: rich-запросы
  some values from: Blockchain
equivalent class: Restriction
  on property: предложение TX в блок
  some values from: Registry
equivalent class: Restriction
  on property: типовые запросы
  some values from: Blockchain
equivalent class: Restriction
  on property: фиксация состояния
  some values from: WS database

Registry
type: Class
comment: The Hyperledger Fabric registry consists of two separate but related parts - the blockchain and the state database, also known as the "world state". Registry is a transaction log structured as blocks of transactions linked to each other using hashes. Peers receive blocks from the ordering service, mark block transactions as valid or invalid based on confirmation policies and concurrency violations, and add the block to the local copy of the blockchain on the peer's file system.
comment: Реестр Hyperledger Fabric состоит из двух отдельных, но связанных c друг другом частей – из блокчейна и state-базы данных, также известной как «World State». Реестр — журнал транзакций, структурированный в виде блоков транзакций, связанных между собой с помощью хешей. Пиры получают блоки от ордеринг-службы, помечают транзакции блока как валидные или невалидные, основываясь на политиках подтверждения и нарушений, связанных с параллелизмом, и добавляют блок в локальную копию блокчейна на файловой системе пира. @ru
label: Реестр @ru
subclass of: Blockchain
equivalent class: Restriction
  on property: ответ по TX
  some values from: HLF_SDK

Smart-contract
type: Class
comment: A smart contract is a program code called by client applications that exist outside the blockchain network that changes or reads the World State or the ledger of transactions In Hyperledger Fabric, smart contracts are contained in the Chaincode package.
comment: Смарт-контракт - это программный код, вызываемый клиентскими приложениями, существующими вне блокчейн-сети, изменяющий или считывающий World State, или реестр транзакций. В Hyperledger Fabric смарт-контракты содержатся в пакете Chaincode. @ru
label: Smart-контракт @ru
subclass of: Blockchain
equivalent class: Restriction
  on property: запрос на фиксациют состояния вWS
  some values from: WS database
equivalent class: Restriction
  on property: вызывает метод
  some values from: HLF_SDK
equivalent class: Restriction
  on property: запрос TX в блокчейн
  some values from: Registry

WS database
type: Class
comment: The World State is a database containing the current values of a set of key-value pairs that have been added, changed, or removed by a set of validated and stored transactions on the blockchain.
comment: World State — это база данных, содержащая текущие значения набора пар ключ-значение которые были добавлены, изменены или удалены набором провалидированных и сохраненных в блокчейн транзакций. @ru
label: WS-база состояний @ru
subclass of: Registry
equivalent class: Restriction
  on property: ответ о состоянии
  some values from: HLF_SDK

WSEvent
type: Class
comment: An event with a supply chain object (EPCISEvent) in HLF World State.base. For each object of supply chains, the World State database contains one record that is currently relevant.
comment: Событие с объектом цепочки поставок (EPCISEvent), фиксируемое в World State HLF. Для каждого объекта цепочек поставки в базе World State содержиться одна актуальная на текущий момент запись. @ru
label: WSСобытие @ru
subclass of: Blockchain
equivalent class: Restriction
  on property: запись в
  some values from: WS database

createEventWorldState()
type: Class
comment: REST API GET метод принимает запрос на создание записи о событии и перенаправляет полученные аргументы в соответствующий метод смарт-контракта - createTradeItemEventWorldState @ru
comment: The REST API GET method accepts a request to create an event record and redirects the received arguments to the corresponding smart contract method - createTradeItemEventWorldState
subclass of: API
equivalent class: Restriction
  on property: запрос на создание WS
  some values from: createTradeItemEventWorldState()

createTradeItemEventWorldState()
type: Class
comment: Implementation of the method TradeItemEventWordStateRepository.createTradeItemEventWorldState(Context, String, String, String, String, String, String, String, String, String, String, String, String, String, String, String, String, String, String) to create a record in the World State (CouchDB) event from the Application.
comment: Реализация метода TradeItemEventWordStateRepository.createTradeItemEventWorldState(Context, String, String, String, String, String, String, String, String, String, String, String, String, String, String, String, String, String, String) по созданию записи в World State (CouchDB) события из Приложения. @ru
subclass of: Smart-contract

deleteEventWorldState()
type: Class
comment: REST API GET метод принимает запрос на удаление записи о событии и перенаправляет полученные аргументы в соответствующий метод смарт-контракта - deleteTradeItemEventWorldState @ru
comment: The REST API GET method accepts a request to delete an event record and redirects the received arguments to the corresponding smart contract method - deleteTradeItemEventWorldState
subclass of: API
equivalent class: Restriction
  on property: запрос на удаление WS
  some values from: deleteTradeItemEventWorldState()

deleteTradeItemEventWorldState()
type: Class
comment: Implementation of the method for deleting an entry from the World State (CouchDB) TradeItemEventWordStateRepository.deleteTradeItemEventWorldState(Context, String) about an event from the Application. deleteTradeItemEventWorldState(Context, String) - Method in interface ids.repository.TradeItemEventWordStateRepository Description of the method signature for deleting an event record from the World State (CouchDB).
comment: Реализация метода удаления записи из World State (CouchDB) TradeItemEventWordStateRepository.deleteTradeItemEventWorldState(Context, String) о событии из Приложения. deleteTradeItemEventWorldState(Context, String) - Method in interface ids.repository.TradeItemEventWordStateRepository Описание сигнатуры метода по удалению записи о событии из World State (CouchDB). @ru
subclass of: Smart-contract

existEventWorldState()
type: Class
comment: REST API GET метод принимает запрос на проверку существаония записи о событии и перенаправляет полученные аргументы в соответствующий метод смарт-контракта - existTradeItemEventWorldState @ru
comment: The REST API GET method accepts a request to verify the existence of an event record and redirects the received arguments to the corresponding smart contract method - existTradeItemEventWorldState
subclass of: API
equivalent class: Restriction
  on property: запрос на проверку WS
  some values from: existTradeItemEventWorldState()

existTradeItemEventWorldState()
type: Class
comment: Implementation of the method for checking the existence of an entry in the World State (CouchDB) TradeItemEventWordStateRepository.existTradeItemEventWorldState(Context, String) about an event from the application. existTradeItemEventWorldState(Context, String) - Method in interface ids.repository.TradeItemEventWordStateRepository Description of the signature of the method for checking the existence of an event record in the World State (CouchDB).
comment: Реализация метода проверки существования записи в World State (CouchDB) TradeItemEventWordStateRepository.existTradeItemEventWorldState(Context, String) о событии из приложнния. existTradeItemEventWorldState(Context, String) - Method in interface ids.repository.TradeItemEventWordStateRepository Описание сигнатуры метода проверки существования записи о событии в World State (CouchDB). @ru
subclass of: Smart-contract

getALLEventWorldStateByDisposition()
type: Class
comment: REST API GET метод принимает запрос на получение всех записей о событиях, в которых присутствует конкретное состояние (disposition) и перенаправляет полученные аргументы в соответствующий метод смарт-контракта - getAllTradeItemEventWorldStateByDisposition. @ru
comment: The REST API GET method accepts a request to receive all event records that contain a specific state (disposition) and redirects the received arguments to the corresponding smart contract method - getAllTradeItemEventWorldStateByDisposition.
subclass of: API
equivalent class: Restriction
  on property: запрос TX по EPC+Disposition

getAllEventTransactionBlockChainByEpc()
type: Class
comment: REST API GET метод принимает запрос на получение истории транзакций из блокченй, которые происходили с конкретной записью в World State и перенаправляет полученные аргументы в соответствующий метод смарт-контракта - getHistoryTradeItemEventBlockChainByEpc @ru
comment: The REST API GET method accepts a request to get the transaction history from the blockchain that occurred with a specific record in the World State and redirects the received arguments to the corresponding smart contract method - getHistoryTradeItemEventBlockChainByEpc
subclass of: API
equivalent class: Restriction
  on property: запрос всех TX по EPC

http://www.semanticweb.org/aagafonov/ontologies/2022/6/untitled-ontology-3#getAllEventTransactionByBusinessStepBlockChain()
type: Class
comment: REST API GET метод принимает запрос на получение истории транзакций из блокченй с конкретным бизнес-шагом, которые происходили с конкретной записью в World State и перенаправляет полученные аргументы в соответствующий метод смарт-контракта - getHistoryTradeItemEventBlockChainByEpcAndBusinessStep @ru
comment: The REST API GET method accepts a request to get a transaction history from a blockchain with a specific business step that occurred with a specific record in the World State and redirects the received arguments to the corresponding smart contract method - getHistoryTradeItemEventBlockChainByEpcAndBusinessStep
subclass of: API
equivalent class: Restriction
  on property: запрос TX по EPC+BusinessStep

http://www.semanticweb.org/aagafonov/ontologies/2022/6/untitled-ontology-3#getAllTradeItemEventWorldStateByDisposition()
type: Class
comment: Implementation of the method for getting all records from the World State (CouchDB) about an event based on the state of the TradeItemEventWordStateRepository.getAllTradeItemEventWorldStateByDisposition(Context, String) object from the application.
comment: Реализация метода получения всех записей из World State (CouchDB) о событии по состоянию объекта TradeItemEventWordStateRepository.getAllTradeItemEventWorldStateByDisposition(Context, String) из приложения. @ru
subclass of: Smart-contract

getBlockNumber()
type: Class
comment: REST API GET метод принимает запрос на получение номера блока по ID транзакции (txId) из блокчейн getResponseFromSmartContract(String, String...) - Method in class by.ids.controllers.TradeItemRestController Отправляет полученные аргмументы из запроса на конкретный метод смарт-контракта по его имени и получает ответ в виде строки JSON @ru
comment: The REST API GET method accepts a request to get the block number by transaction ID (tsig) from the blockchain getResponseFromSmartContract(String, String...) - - Method in class by.ids.controllers.TradeItemRestController Sends the received arguments from the request to a specific smart contract method by its name and receives a response in the form of a JSON string
subclass of: API

http://www.semanticweb.org/aagafonov/ontologies/2022/6/untitled-ontology-3#getHistoryTradeItemEventBlockChainByEpc()
type: Class
comment: Implementation of the method for obtaining the history of transactions from the blockchain by epc, carried out with an event record in the World State (CouchDB)
comment: Реализация метода получения истории транзакций из блокчейн по epc, проводимых с записью о событии в World State (CouchDB) @ru
subclass of: Smart-contract

http://www.semanticweb.org/aagafonov/ontologies/2022/6/untitled-ontology-3#getHistoryTradeItemEventBlockChainByEpcAndBusinessStep()
type: Class
comment: Implementation of a method for receiving transactions from the blockchain of a specific epc and with a specific businessStep. getHistoryTradeItemEventBlockChainByEpcAndBusinessStep(Context, String, String) - Method in interface ids.repository.TradeItemEventBlockChainRepository
comment: Реализация метода получения транзакций из блокчейн конкретного epc и с определенным businessStep. getHistoryTradeItemEventBlockChainByEpcAndBusinessStep(Context, String, String) - Method in interface ids.repository.TradeItemEventBlockChainRepository @ru
subclass of: Smart-contract

readEventWorldState()
type: Class
comment: REST API GET метод принимает запрос на чтение записи о событии и перенаправляет полученные аргументы в соответствующий метод смарт-контракта - readTradeItemEventWorldState. @ru
comment: The REST API GET method accepts a request to read an event record and redirects the received arguments to the corresponding smart contract method - readTradeItemEventWorldState.
subclass of: API
equivalent class: Restriction
  on property: запрос на чтение WS
  some values from: readTradeItemEventWorldState()

readTradeItemEventWorldState()
type: Class
comment: Implementation of the method for obtaining the state of an object from the World State.
comment: Реализация метода получения состояни объекта из World State. @ru
subclass of: Smart-contract

rich-запросы
type: ObjectProperty
comment: Extended requests to the blockchain network for the specified parameters from the CBV dictionary.
comment: Расширенные запросы в сеть блокчейн по указанным параметрам из словаря CBV. @ru

richQueryAllEventWorldState()
type: Class
comment: REST API GET метод принимает запрос на получение всех записей о событиях и перенаправляет полученные аргументы в соответствующий метод смарт-контракта - richQueryTradeItemEventWorldState. @ru
comment: The REST API GET method accepts a request to receive all event records and redirects the received arguments to the corresponding smart contract method - richQueryTradeItemEventWorldState.
subclass of: API
equivalent class: Restriction
  on property: запрос всех записей в WS
  some values from: richQueryTradeItemEventWorldState()

richQueryBlockChain()
type: Class
comment: REST API GET метод принимает запрос на получение отфильтрованной истории транзакий из блокчейн, которые происходили с конкретной записью в World State и перенаправляет полученные аргументы в соответствующий метод смарт-контракта - richQueryBlockChain. @ru
comment: The REST API GET method accepts a request to get a filtered transaction history from the blockchain that occurred with a specific record in the World State and redirects the received arguments to the corresponding smart contract method - richQueryBlockChain.
subclass of: API
equivalent class: Restriction
  on property: запрос TX в блокчейн
  some values from: richQueryBlockChainTX()

richQueryBlockChainTX()
type: Class
comment: Description of the signature of the method for obtaining the history of transactions by the parameters of interest from the blockchain, performed on a record in the World State (CouchDB).
comment: Описание сигнатуры метода получения истории транзакций по интересующим параметрам из блокчейн, производимых над записью в World State (CouchDB). @ru
subclass of: Smart-contract

richQueryTradeItemEventWorldState()
type: Class
comment: Implementation of the method for obtaining all records from the World State (CouchDB) about an event by the given parameters TradeItemEventWordStateRepository.richQueryTradeItemEventWorldState(Context, String, String, String, String, String, String, String, String) from the application.
comment: Реализация метода получения всех записей из World State (CouchDB) о событии по заданным параметрам TradeItemEventWordStateRepository.richQueryTradeItemEventWorldState(Context, String, String, String, String, String, String, String, String) из приложения. @ru
subclass of: Smart-contract

updateEventWorldState()
type: Class
comment: REST API GET метод принимает запрос на обновление записи о событии и перенаправляет полученные аргументы в соответствующий метод смарт-контракта - updateTradeItemEventWorldState @ru
comment: The REST API GET method accepts a request to update the event record and redirects the received arguments to the corresponding smart contract method - updateTradeItemEventWorldState
subclass of: API
equivalent class: Restriction
  on property: запрос на обновление WS
  some values from: updateTradeItemEventWorldState()

updateTradeItemEventWorldState()
type: Class
comment: Implementation of the TradeItemEventWordStateRepository.updateTradeItemEventWorldState(Context, String, String, String, String, String, String, String, String, String, String, String, String, String, String, String, String, String, String) method to update an entry in the World State (CouchDB) events from the application.
comment: Реализация метода TradeItemEventWordStateRepository.updateTradeItemEventWorldState(Context, String, String, String, String, String, String, String, String, String, String, String, String, String, String, String, String, String, String) по обновлению записи в World State (CouchDB) события изприложения. @ru
subclass of: Smart-contract

вызывает метод
type: ObjectProperty
comment: The property of calling an API method or a smart contract function or a Hyperledger Fabric blockchain SDK method.
comment: Свойство вызова метода API или функции умного контракта или метода SDK блокчейн Hyperledger Fabric. @ru

запрос TX в блокчейн
type: ObjectProperty
comment: A property that defines the operation of requesting transaction data, recorded in the blockchain registry.
comment: Свойство, определяющее операцию запроса данных о транзакции, зафиксированной в реестре блокчейн. @ru

запрос TX по EPC+BusinessStep
type: ObjectProperty
comment: A property that defines a transaction request to the blockchain registry, taking into account the specified filtering by the EPC code of the object and a specific business step.
comment: Свойство, определяющее запрос по транзакциям в реестр блокчейн с учётом указанной фильтрации по EPC коду объекта и конкретному бизнес шагу. @ru

запрос TX по EPC+Disposition
type: ObjectProperty
comment: A property that defines a transaction request to the blockchain registry, taking into account the specified filtering by the EPC code of the object and a specific disposition.
comment: Свойство, определяющее запрос по транзакциям в реестр блокчейн с учётом указанной фильтрации по EPC коду объекта и конкретной диспозиции. @ru
sub property of: topObjectProperty

запрос всех TX по EPC
type: ObjectProperty
comment: A property that reflects a request from the transaction registry for all transactions related to the EPC specified in the request.
comment: Свойство, отражающее запрос с реестр транзакций по всем транзакциям, связанным с указанным в запросе EPC. @ru

запрос всех записей в WS
type: ObjectProperty
comment: A property that reflects a request to get all records in the World State database.
comment: Свойство, отражающее запрос на получение всех записей в базе состояний World State. @ru

запрос на обновление WS
type: ObjectProperty
type: FunctionalProperty
comment: A property that reflects the WS update request for the specified object.
comment: Свойство, отражающее запрос на обновление WS для указанного объекта. @ru
equivalent property: запрос на создание WS
equivalent property: фиксация состояния

запрос на проверку WS
type: ObjectProperty
comment: A property that reflects a request to check the status in WS for the specified object.
comment: Свойство, отражающее запрос на проверку наличия состояния в WS для указанного объекта. @ru
sub property of: topObjectProperty

запрос на создание WS
type: ObjectProperty
type: FunctionalProperty
comment: A property that reflects a request to create a record of the state of a new object in the World State database.
comment: Свойство, отражающее запрос на создание записи о состоянии нового объекта в базе World State. @ru
equivalent property: запрос на удаление WS
equivalent property: фиксация состояния

запрос на удаление WS
type: ObjectProperty
type: FunctionalProperty
comment: A property that reflects a request to delete an object's state record from the World State database.
comment: Свойство, отражающее запрос на удаление записи состояния объекта из базы World State. @ru
equivalent property: фиксация состояния

запрос на чтение WS
type: ObjectProperty
comment: Свойство, отражающее запрос на получение данных о состоянии указанного объекта из базы World State.

ответ о состоянии
type: ObjectProperty
comment: A property that defines the response of a smart contract to a request about the state of an object in the World State database.
comment: Свойство, определчяющее ответ умного контракта на запрос о состоянии объекта в базе World State. @ru

ответ по TX
type: ObjectProperty
comment: A property that defines the smart contract's response to a transaction request in the registry.
comment: Свойство, определяющее ответ умного контракта на запрос о транзакции в реестре. @ru

предлагает Tx
type: ObjectProperty
comment: The property of offering a transaction to the blockchain network.
comment: Свойство предложения транзакции в сеть блокчейн. @ru

предложение TX в блок
type: ObjectProperty
comment: The property of offering a transaction to the blockchain network for its verification and placement in the block.
comment: Свойство предложения транзакции в сеть блокчейн для её проверки и пмещения в блок. @ru

реализует
type: ObjectProperty
type: FunctionalProperty
comment: A property that reflects the implementation of one concept by another. For example, "application implements an API" (logical statement "Application реализует some API").,
comment: Свойство, отражаюшее реализацию одного понятия, другим. К примеру, "приложение реализует API" (логическое утверждение "Application реализует some API"). @ru

типовые запросы
type: ObjectProperty
comment: A property that reflects the formation of typical requests to the blockchain network.
comment: Свойство, отражающее формирование типовых запросов в сеть блокчейн. @ru
sub property of: topObjectProperty

фиксация состояния
type: ObjectProperty
type: FunctionalProperty
comment: A property that reflects the fact that the event was fixed in the World State state base. Examples of logical statements: HLF_SDK EquivalentTo фиксация_состояния some WS-database запрос_на_удаление_WS EquivalentTo фиксация_состояния запрос_на_создание_WS EquivalentTo фиксация_состояния запрос_на_обновление_WS EquivalentTo фиксация_состояния
comment: Свойство, отражающее факт фиксации события в базе состояний World State. Примеры логических утверждений: HLF_SDK EquivalentTo фиксация_состояния some WS-database запрос_на_удаление_WS EquivalentTo фиксация_состояния запрос_на_создание_WS EquivalentTo фиксация_состояния запрос_на_обновление_WS EquivalentTo фиксация_состояния @ru

spesialaizes
type: AnnotationProperty
comment: Borrowing concepts from other ontologies.
comment: Заимствование понятий из других онтологий. @ru

Upstream EPCIS Event
type: NamedIndividual
type: Business Transaction Type
type: CBV Code Lists
comment: Event ID URI(s) of event(s) provided by an upstream supplier, such as packing and shipping events (e.g., as the basis for the inferred completeness of inbound aggregations).
comment: Идентификаторы URI событий, предоставленные основным поставщиком, такие как события упаковки и отгрузки (например, в качестве основы для предполагаемой полноты входящих агрегаций). @ru
label: cобытие EPCIS восходящего потока @ru

EPCISRepository
type: Class
comment: EPCISRepository defines the concept of a data warehouse based on events recorded during the movement of objects along the supply chain.
comment: EPCISRepository определяет понятие хранилища данных по событиям, зафиксированным в процессе движения объектов по цепочке поставок. @ru
label: Репозитарий EPCIS @ru
subclass of: Concepts of event recording technology in supply chains based on EPCIS services in accordance with ISO/IEC 19987:2017 Information Technology - EPC Information Services (EPCIS) standard.

RecordongTimeEpochSeconds
type: DatatypeProperty
comment: Recording time in seconds Apoch 01.01.1970 (UTC)
comment: Время регистрации события в секундах (Recording time in seconds Apoch 01.01.1970 (UTC)) @ru
sub property of: wsEventData

SensorElement
type: Class
comment: A SensorElement is a structure that contains an optional sensorMetadata structure and one or several sensorReport structures
comment: SensorElement — это понятие, включающее необязательную структуру sensorMetadata и одну или несколько структур sensorReport. @ru
label: Сенсор @ru
subclass of: Concepts of event recording technology in supply chains based on EPCIS services in accordance with ISO/IEC 19987:2017 Information Technology - EPC Information Services (EPCIS) standard.

SensorMetadata
type: Class
comment: (Optional) An element containing one or several metadata attributes, which are applicable to all sensorReport elements that are part of the same sensorElement.
comment: (Необязательно) Элемент, содержащий один или несколько атрибутов метаданных, применимых ко всем элементам sensorReport, которые являются частью одного и того же элемента sensorElement. @ru
label: Метаданные сенсора @ru
subclass of: SensorElement

An element containing one or several attributes that pertain to a specific sensor observation.
type: Class
comment: Данные наблюдения сенсора @ru
comment: Элемент, содержащий один или несколько атрибутов, относящихся к конкретному наблюдению сенсора/датчика. @ru
label: SensorReport
subclass of: SensorElement

addInWSDateTime
type: DatatypeProperty
comment: The time when the event was recorded in the World State database.
comment: Время фиксации события в базе Worls State. @ru
sub property of: wsEventData

addInWSDay
type: DatatypeProperty
comment: The day the event was added to the World State database.
comment: День добавления события в базу World State. @ru
sub property of: wsEventData

addInWSEpochSecond
type: DatatypeProperty
comment: Epoch Time in seconds from 01.01.1970 (UTC).
comment: Время добавления записи в World State в секундах (Epoch Time in seconds from 01.01.1970 (UTC). @ru
sub property of: wsEventData

addInWSMonth
type: DatatypeProperty
comment: The month in which the entry was added to the World State.
comment: Месяц добавления записи в World State. @ru
sub property of: wsEventData

addInWSYear
type: DatatypeProperty
comment: The year in which the entry was added to the World State.
comment: Год добавления записи в World State. @ru
sub property of: wsEventData

anyURI
type: DatatypeProperty
comment: Any IRI used to identify a concept in an ontology.
comment: Любой IRI, применяемый для идентификации понятия в онтологии. @ru

businesRules
type: NamedIndividual
type: SensorElement
type: SensorMetadata
comment: (Optional) Storage location of an electronic document accommodating product- or application-specific business rules on which basis the EPCIS event was triggered. For instance, an EPCIS capturing application might only trigger an event if the 'what' dimension contains a certain product class (e.g. GTIN of a cold-storage pharmaceutical product) AND a certain temperature threshold was exceeded. Note: In contrast to a business transaction, a business rules file is not a standard-defined, interoperably communicated business document such as an invoice. In addition, the set of rules typically will only change in an infrequent manner.
comment: (Необязательно) Место хранения электронного документа, содержащего бизнес-правила для конкретного продукта или приложения, на основании которых было инициировано событие EPCIS. Например, приложение захвата EPCIS может инициировать событие только в том случае, если параметр «что» содержит определенный класс продукта (например, GTIN фармацевтического продукта, хранящегося в холодильнике) И превышен определенный температурный порог. Примечание. В отличие от бизнес-транзакции, файл бизнес-правил не является стандартно определяемым бизнес-документом с возможностью взаимодействия, например счетом-фактурой. Кроме того, набор правил обычно меняется нечасто. @ru
label: бизнес правила @ru

booleanValue
type: NamedIndividual
type: SensorElement
type: An element containing one or several attributes that pertain to a specific sensor observation.
label: логическое значение @ru

businessStep
type: DatatypeProperty
comment: Event Business Step value.
comment: Значение бизнес шага в событии. @ru
domain: Business Step ID
range: string
sub property of: wsEventData

chemicalSubstance
type: NamedIndividual
type: SensorElement
type: An element containing one or several attributes that pertain to a specific sensor observation.
comment: If chemicalSubstance is present, a sensorReport element SHALL NOT include microorganism.
comment: Если присутствует химическое вещество, элемент SensorReport НЕ ДОЛЖЕН включать микроорганизмы. @ru
label: химическая субстанция @ru

component
type: NamedIndividual
type: SensorElement
type: An element containing one or several attributes that pertain to a specific sensor observation.
comment: (Optional) Some measurement types (e.g. force, pressure) are vectors (having magnitude and direction in space), whereas others (e.g. temperature, absolute humidity) are scalars. The components of a vector in a coordinate system can be specified by setting the value of component to indicate which vector component has magnitude indicated by the value parameter. The SensorReport element is then repeated as two or three instances to express each component of the vector in two or three dimensions, the pair or trio of SensorReport elements sharing the same values for all fields except value, component and uom (which may differ for each vector component). If present, the SensorReport element MUST also include the value and uom fields.
comment: (Необязательно) Некоторые типы измерений (например, сила, давление) являются векторами (имеющими величину и направление в пространстве), тогда как другие (например, температура, абсолютная влажность) являются скалярами. Компоненты вектора в системе координат могут быть указаны путем установки значения компонента, чтобы указать, какой компонент вектора имеет величину, указанную параметром значения. Затем элемент SensorReport повторяется как два или три экземпляра, чтобы выразить каждый компонент вектора в двух или трех измерениях, пара или три элемента SensorReport имеют одинаковые значения для всех полей, кроме значения, компонента и единицы измерения (которые могут различаться для каждого компонент вектора). Если присутствует, элемент SensorReport ДОЛЖЕН также включать поля value и uom. @ru
label: компонент @ru

coordinatReferenceSystemURI
type: NamedIndividual
type: SensorElement
type: An element containing one or several attributes that pertain to a specific sensor observation.
comment: (Optional) A URI identifying the Coordinate Reference System. If omitted, the World Geodetic System 1984 (WGS-84) is assumed to apply.
comment: (Необязательно) URI, идентифицирующий систему отсчета координат. Если опущено, предполагается, что применяется Всемирная геодезическая система 1984 г. (WGS-84). @ru
label: система координат @ru

ctx
type: DatatypeProperty
comment: Chaincode Context. The data context defined by the account system to be passed to the smart contract.
comment: Контекст данных, определяемый учейтной системой для передачи умному контракту. @ru
sub property of: wsEventData

dataProcessingMethod
type: NamedIndividual
type: SensorElement
type: An element containing one or several attributes that pertain to a specific sensor observation.
comment: (Optional) Storage location of an electronic document accommodating the data processing method of the contained sensor data, if applicable. For instance, before sensor data is captured in an EPCIS event, the latter might be redacted or refined by means of specific algorithms.
comment: (Необязательно) Место хранения электронного документа, отражающего метод обработки содержащихся данных датчика, если применимо. Например, до того, как данные датчика будут захвачены в событии EPCIS, последнее может быть отредактировано или уточнено с помощью специальных алгоритмов. @ru
label: метод обработки данных @ru

dataProcessingMethodURI
type: NamedIndividual
type: SensorElement
type: SensorMetadata
comment: (Optional) Storage location of an electronic document accommodating the data processing method of the contained sensor data, if applicable. For instance, before sensor data is captured in an EPCIS event, the latter might be redacted or refined by means of specific algorithms.
comment: (Необязательно) Место хранения электронного документа, отражающего метод обработки содержащихся данных датчика, если применимо. Например, до того, как данные датчика будут захвачены в событии EPCIS, последнее может быть отредактировано или уточнено с помощью специальных алгоритмов. @ru
label: метод обработки данных сенсора @ru

deviceID
type: NamedIndividual
type: SensorElement
type: SensorMetadata
type: An element containing one or several attributes that pertain to a specific sensor observation.
comment: (Optional) Device from which the sensor data originates.
comment: (Необязательно) Устройство, с которого поступают данные датчика. @ru
label: идентификатор устройства @ru

deviceMetadata
type: NamedIndividual
type: SensorElement
type: SensorMetadata
type: An element containing one or several attributes that pertain to a specific sensor observation.
comment: (Optional) Storage location of an electronic document accommodating metadata of the device from which the sensor data originates.
comment: (Необязательно) Место хранения электронного документа, содержащего метаданные устройства, с которого поступают данные датчика. @ru
label: метаданные устройства @ru

disposition
type: DatatypeProperty
comment: Оиоусе disposition in supply chain.
comment: Текущая диспозиция (состояние) объекта в цепочке поставок. @ru
domain: Disposition ID
range: string
sub property of: wsEventData

endTime
type: NamedIndividual
type: SensorElement
type: SensorMetadata
comment: (Optional) The highest (most recent) value of a given observation period, as transmitted by a sensor device. If present, the endTime SHALL be less (earlier) than or equal to the eventTime value.
comment: (Необязательно) Самое высокое (самое последнее) значение за данный период наблюдения, переданное сенсорным устройством. Если присутствует, endTime ДОЛЖЕН быть меньше (ранее) значения eventTime или равно ему. @ru
label: время последнего сигнала @ru

epc
type: DatatypeProperty
comment: Electronic Product Code - SGTIN
comment: Электронный код продукта - SGTIN @ru
sub property of: wsEventData

eventType
type: DatatypeProperty
comment: EventType - Association, Aggregation, Transformation, ObjectEvent or Transaction Event
comment: Типы событий - Association, Aggregation, Transformation, ObjectEvent or TransactionEvent @ru
domain: EPCIS Event
range: string
sub property of: wsEventData

exception
type: NamedIndividual
type: SensorElement
type: An element containing one or several attributes that pertain to a specific sensor observation.
comment: Condition or an error condition. When this field is used, extra details can be specified via `booleanValue` or `uriValue`.
comment: Cостояние ошибки. При использовании этого поля дополнительные сведения можно указать с помощью `booleanValue` или `uriValue`. @ru
label: состяние ошибки/исключения @ru

hashOfEPCISDocument
type: DatatypeProperty
comment: EPCIS Document HASH (Event hash)
comment: Hash события, описанного в EPCISDocument. @ru
range: token
sub property of: wsEventData

hexBinaryValue
label: десятичное значение @ru

linkToEPCISDocument
type: DatatypeProperty
comment: Link to EPCISDocument in repository.
comment: Ссылка на EPCISDocument в репозитарии событий EPCIS. @ru
range: anyURI
sub property of: wsEventData

maxValue
type: NamedIndividual
type: SensorElement
type: An element containing one or several attributes that pertain to a specific sensor observation.
comment: (Optional) Similar to minValue, for the maximum quantitative value.
comment: (Необязательно) Аналогично minValue для максимального количественного значения. @ru
label: максимальное значение @ru

meanVakue
type: NamedIndividual
type: SensorElement
type: An element containing one or several attributes that pertain to a specific sensor observation.
comment: (Optional) The arithmetic mean of the values of the property specified by the type as part of the sensorReport element. If a startTime and endTime field is present, the meanValue SHALL pertain to the resulting period. Otherwise, it SHALL pertain to the business process step the EPCIS event captures.
comment: (Необязательно) Среднее арифметическое значений свойства, заданного типом в составе элемента sensorReport. Если присутствуют поля startTime и endTime, среднее значение ДОЛЖНО относиться к результирующему периоду. В противном случае он ДОЛЖЕН относиться к шагу бизнес-процесса, который захватывает событие EPCIS. @ru
label: среднеарифметическое значение @ru

measurementType
type: NamedIndividual
type: SensorElement
type: An element containing one or several attributes that pertain to a specific sensor observation.
comment: An identifier that indicates what kind of measurement the SensorReport pertains to (e.g. Length, Mass, Temperature).
comment: Идентификатор, указывающий, к какому измерению относится SensorReport (например, длина, масса, температура). @ru
label: тип измерения сенсора @ru

microorganism
type: NamedIndividual
type: SensorElement
type: An element containing one or several attributes that pertain to a specific sensor observation.
comment: (Optional) Identifies a specific microorganism species. If microorganism is present, a sensorReport element SHALL NOT include chemicalSubstance.
comment: (Необязательно) Идентифицирует конкретный вид микроорганизмов. Если присутствует микроорганизм, элемент SensorReport НЕ ДОЛЖЕН включать химическое вещество. @ru
label: вид микроорганизма @ru

minValue
comment: (Optional) Minimum quantitative value of the property specified by type , as part of the sensorReport element. If a startTime and endTime field is present, the minValue SHALL pertain to the resulting period. Otherwise, minValue SHALL pertain to the business process step the EPCIS event captures.
comment: (Необязательно) Минимальное количественное значение свойства, заданного type , как часть элемента sensorReport. Если присутствуют поля startTime и endTime, minValue ДОЛЖЕН относиться к результирующему периоду. В противном случае minValue ДОЛЖЕН относиться к шагу бизнес-процесса, который захватывает событие EPCIS. @ru
label: минимальное значение свойства @ru

percRunk
type: NamedIndividual
type: SensorElement
type: An element containing one or several attributes that pertain to a specific sensor observation.
comment: (Optional) Percentile rank, signifying the percentage of observations in a frequency distribution that are equal to or lower than it. percRank SHALL only be used in conjunction with the field percValue.
comment: (Необязательно) Процентильный ранг, обозначающий процент наблюдений в частотном распределении, которые равны ему или ниже его. percRank ДОЛЖЕН использоваться только вместе с полем percValue. @ru
label: наблюдения в процентах @ru

(Optional) The percentile value, at or below which a given percentage of observations (as specified by percRank) may be found. percValue SHALL only be used in conjunction with the field percRank.
comment: (Необязательно) Значение процентиля, при котором или ниже которого может быть найден данный процент наблюдений (как указано percRank). percValue ДОЛЖЕН использоваться только вместе с полем percRank. @ru
label: percValue
label: значение в процентах @ru

rawData
type: NamedIndividual
type: SensorElement
type: SensorMetadata
type: An element containing one or several attributes that pertain to a specific sensor observation.
comment: (Optional) Storage/service location of the raw sensor data on which the aggregated/business-oriented data contained in the sensorElement is based.
comment: (Необязательно) Ссылка на место хранения необработанных данных датчика, на которых основаны агрегированные/ориентированные на бизнес данные, содержащиеся в элементе датчика. @ru
label: необработанные данные @ru

recordingTime
type: DatatypeProperty
comment: Event time from Application
comment: Время события, зафиксированное в приложении. @ru
sub property of: wsEventData

recordingTimeMonth
type: DatatypeProperty
comment: Month of event registration.
comment: Месяц регистрации события. @ru
sub property of: wsEventData

recordingTymeDay
type: DatatypeProperty
comment: The day the event was registered.
comment: День регистрации события. @ru
sub property of: wsEventData

recordingTymeYear
type: DatatypeProperty
comment: The year the event was registered.
comment: Год регистрации события. @ru
sub property of: wsEventData

sDev
type: NamedIndividual
type: SensorElement
type: An element containing one or several attributes that pertain to a specific sensor observation.
comment: SensorElement parameter
comment: Параметр описания SensorElement @ru

sgln
type: DatatypeProperty
comment: Event location - SGLN
comment: Локация в которой зафиксировано событияе - SGLN @ru
sub property of: wsEventData

startTime
type: NamedIndividual
type: SensorElement
type: SensorMetadata
comment: (Optional) The lowest (earliest) value of a given observation period as transmitted by a sensor device. If present, the startTime SHALL be less (earlier) than the eventTime value and the endTime value.
comment: (Необязательно) Самое низкое (самое раннее) значение данного периода наблюдения, переданное сенсорным устройством. Если присутствует, startTime ДОЛЖЕН быть меньше (ранее), чем значение eventTime и значение endTime. @ru
label: dateTimeStamp
label: Время начала измерений @ru

stringValue
type: NamedIndividual
type: SensorElement
type: An element containing one or several attributes that pertain to a specific sensor observation.
comment: The SensorElement parameter. Describes the value of a string variable.
comment: Параметр SensorElement. Описывает значение строковой переменной. @ru

time
type: NamedIndividual
type: SensorElement
type: SensorMetadata
type: An element containing one or several attributes that pertain to a specific sensor observation.
comment: (Optional) The actual point in time of an observation as transmitted by a sensor device. If present, the time value SHALL be less (earlier) than or equal to the eventTime value. It SHALL also contain a time zone offset value. The coordination and integrity of distributed computing requires time synchronisation of EPCIS events conveying sensor data. Therefore, when populating the time, startTime, and endTime field, EPCIS capture applications SHOULD apply established time synchronisation protocols such as IEEE 1588-2008, which provides a standard method to synchronise device clocks in a network. Note: The eventTime applies to the completion of a business step, not a sensor observation. For instance, for a receiving event accommodating a sensor element, the eventTime indicates when goods were received ' it gives no information when certain conditions (e.g. a specific temperature value) held true. In some circumstances, event and sensor observation times may correspond though (e.g. if a quality inspector checks certain properties of goods). In such cases, indicating the eventTime may be sufficient.
comment: (Необязательно) Фактический момент времени наблюдения, переданный сенсорным устройством. Если присутствует, значение времени ДОЛЖНО быть меньше (ранее) значения eventTime или равно ему. Он ДОЛЖЕН также содержать значение смещения часового пояса. Координация и целостность распределенных вычислений требуют временной синхронизации событий EPCIS, передающих данные датчиков. Следовательно, при заполнении полей времени, startTime и endTime приложениям захвата EPCIS СЛЕДУЕТ применять установленные протоколы синхронизации времени, такие как IEEE 1588-2008, которые обеспечивают стандартный метод синхронизации часов устройств в сети. Примечание. EventTime применяется к завершению бизнес-этапа, а не к наблюдению датчика. Например, для события получения, связанного с сенсорным элементом, eventTime указывает, когда товар был получен, но не дает информации, когда выполняются определенные условия (например, определенное значение температуры). Однако в некоторых случаях время наблюдения события и датчика может совпадать (например, если инспектор по качеству проверяет определенные свойства товара). В таких случаях может быть достаточно указания eventTime. @ru
label: точное время наблюдения @ru

uom
type: NamedIndividual
type: SensorElement
type: An element containing one or several attributes that pertain to a specific sensor observation.
comment: (Optional) Unit of measure by which the specified value(s) of the property specified by type should be interpreted. If there is no value, minValue, maxValue, averageValue or percValue field present, uom SHALL be omitted. When a uom field is present, its value SHALL be the 2- or 3-character code for a physical unit specified in the 'Common Code' column of UN/CEFACT Recommendation'20 [CEFACT20]. Note: GS1 provides a GitHub Repository containing a machine-readable file which enables the automatic conversion between quantitative values expressed using UN/CEFACT common codes. [https://github.com/gs1/UnitConverterUNECERec20]
comment: (Необязательно) Единица измерения, с помощью которой следует интерпретировать указанное значение(я) свойства, заданного типом. Если значение отсутствует, поле minValue, maxValue, mediumValue или percValue не указывается, uom ДОЛЖЕН быть опущен. Когда присутствует поле uom, его значение ДОЛЖНО быть 2- или 3-значным кодом для физической единицы, указанной в столбце «Общий код» Рекомендации СЕФАКТ ООН'20 [CEFACT20]. Примечание. GS1 предоставляет репозиторий GitHub, содержащий машиночитаемый файл, который обеспечивает автоматическое преобразование количественных значений, выраженных с использованием общих кодов СЕФАКТ ООН. [https://github.com/gs1/UnitConverterUNECERec20] @ru
label: единица измерения @ru

uriValue
type: NamedIndividual
type: SensorElement
type: An element containing one or several attributes that pertain to a specific sensor observation.
label: значение URI @ru

wsEventData
type: DatatypeProperty
comment: Top-level class that defines event data with IoT sensors.
comment: Класс верхнего уровня, определяющий данные событий с датчиками IoT. @ru
domain: EPCIS Event

Container
type: Class
comment: A standard box designed for the transportation of goods by various modes of transport (roads, rail, ships) and adapted for mechanized reloading from one mode of transport to another (cranes, pilers, etc.)
comment: Cтандартный ящик, предназначенный для перевозки грузов различными видами транспорта (автомобилями, железной дорогой, судами) и приспособленный для механизированной перегрузки с одного вида транспорта на другой (подъёмными кранами, штабелёрами и т. д.) @ru
label: Контейнер @ru
subclass of: ProductBatch/Lot
subclass of: ProductBatch

ProductBatch
type: Class
comment: A batch of products is a set of units of homogeneous products produced during a certain period of time in the same conditions and accompanied by one shipping document.
comment: Партия продукции – совокупность единиц однородной продукции, произведенной в течение определенного интервала времени в одних и тех же условиях и сопровождаемой одним товаросопроводительным документом. @ru
label: Партия товара @ru
subclass of: Product
subclass of: Object

запись в
type: ObjectProperty
type: FunctionalProperty
comment: An event that reflects the fact that information is being written to a specific location. Logic statement example: WSEvent EquivalentTo запись_в some WS-database
comment: Событие, отражающее факт записи информации в определённое место. Пример логического утверждения: WSEvent EquivalentTo запись_в some WS-database @ru
sub property of: запрос на обновление WS
sub property of: запрос на создание WS
sub property of: запрос на удаление WS
sub property of: фиксация состояния

фиксация события
type: ObjectProperty
comment: A property that reflects the fact that an event is fixed in the supply chain. Logic statement example: EPCISEvent EquivalentTo фиксация события some EPCISRepository
comment: Свойство, отражающее факт фиксации события в цепочке поставок. Пример логического утверждения: EPCISEvent EquivalentTo фиксация_события some EPCISRepository @ru

langString
type: Datatype
entity position:
  entity position x: 197.40688396187107
  entity position y: 195.24316365678038
  comment: This is an entity positioning annotation generated by CoModIDE (https://comodide.com/). Removing this annotation will break rendering the CoModIDE schema diagram view.

Business Transaction Type
type: Class
comment: These identifiers may be used to populate the type attribute of a bizTransaction element in an EPCIS event.
comment: Идентификаторы BTT (Business Transaction Type) применяютсяя для заполнения атрибута type элемента транзакции в событии EPCIS. @ru
label: Типы бизнес транзакций @ru
subclass of: CBV Code Lists
term status: stable

Bill of Lading
type: NamedIndividual
type: Business Transaction Type
type: CBV Code Lists
comment: A document issued by a carrier to a shipper, listing and acknowledging receipt of goods for transport and specifying terms of delivery.
comment: Документ, выдаваемый перевозчиком грузоотправителю, содержащий перечень и подтверждающий получение товаров для транспортировки и определяющий условия доставки. @ru
label: Товаро-транспортная накладная @ru
term status: stable

Certificate
type: NamedIndividual
type: Business Transaction Type
type: CBV Code Lists
comment: A document confirming certain characteristics of an object (e.g. product), person, or organisation, typically issued by a third party.
comment: Документ, подтверждающий определенные характеристики объекта (например, продукта), лица или организации, обычно выдаваемый третьей стороной. @ru
label: cертификат @ru
term status: stable

Despatch Advice
type: NamedIndividual
type: Business Transaction Type
type: CBV Code Lists
comment: A document/message by means of which the seller or consignor informs the consignee about the despatch of goods. Also called an 'Advanced Shipment Notice', but the value `desadv` is always used regardless of local nomenclature.
comment: Документ или сообщение, с помощью которого продавец или грузоотправитель информирует грузополучателя об отправке товаров. Также может называться как "Предварительное уведомление об отправке" (Advanced Shipment Notice), но значение DESADV всегда используется независимо от местной номенклатуры. @ru
label: извещение об отправке @ru
term status: stable

Invoice
type: NamedIndividual
type: Business Transaction Type
type: CBV Code Lists
comment: A document/message claiming payment for goods or services supplied under conditions agreed by the seller and buyer.
comment: Документ или сообщение, требующее оплаты за товары или услуги, поставляемые на условиях, согласованных продавцом и покупателем @ru
label: cчет-фактура @ru
term status: stable

Pedigree
type: NamedIndividual
type: Business Transaction Type
type: CBV Code Lists
comment: A record that traces the ownership or custody and transactions of a product as it moves among various trading partners.
comment: Запись, которая прослеживает право собственности на продукт, право на его хранение и операции по продукту по мере его продвижения между различными торговыми партнерами. @ru
label: родословная @ru
term status: stable

Purchase Order
type: NamedIndividual
type: Business Transaction Type
type: CBV Code Lists
comment: A document/message that specifies details for goods and services ordered under conditions agreed by the seller and buyer.
comment: Документ или сообщение, в котором указаны сведения о товарах и услугах, заказанных на условиях, согласованных продавцом и покупателем. @ru
label: заказ на покупку @ru
term status: stable

Purchase Order Confirmation
type: NamedIndividual
type: Business Transaction Type
type: CBV Code Lists
comment: A document that provides confirmation from an external supplier to the request of a purchaser to deliver a specified quantity of material, or perform a specified service, at a specified price within a specified time. (Sometimes internally referred to as a 'Sales Order'.)
comment: Документ, который предоставляет подтверждение от внешнего поставщика заявки покупателя доставить указанное количество материала или предоставить указанную услугу по определенной цене в течение определенного времени. @ru
label: подтверждение заказа на покупку @ru
term status: stable

Production Order
type: NamedIndividual
type: Business Transaction Type
type: CBV Code Lists
comment: An organisation-internal document or message issued by a producer that initiates a manufacturing process of goods.
comment: Изданный производителем внутризаводской документ или сообщение, которое инициирует процесс производства товаров. @ru
label: заказ-наряд на изготовление продукции @ru
term status: stable

Receiving Advice
type: NamedIndividual
type: Business Transaction Type
type: CBV Code Lists
comment: A document/message that provides the receiver of the shipment the capability to inform the shipper of actual goods received, compared to what was advised as being sent.
comment: Документ или сообщение, которое предоставляет получателю груза возможность информировать грузоотправителя о фактически полученных товарах, по сравнению с тем, какие товары были заявлены отправленными. @ru
label: уведомление о приемке @ru
term status: stable

Return Merchandise Authorisation
type: NamedIndividual
type: Business Transaction Type
type: CBV Code Lists
comment: A document issued by the seller that authorises a buyer to return merchandise for credit determination.
comment: Документ, выданный продавцом, который разрешает покупателю вернуть товар для определения причитающейся суммы. @ru
label: разрешение на возврат товара @ru
term status: stable

Test Procedure
type: NamedIndividual
type: Business Transaction Type
type: CBV Code Lists
comment: A document that provides a formal specification of a sequence of instructions for the purpose of verifying one or several criteria.
comment: Документ, который содержит формальную спецификацию последовательности инструкций с целью проверки одного или нескольких критериев. @ru
label: процедура испытания @ru
term status: stable

Test Result
type: NamedIndividual
type: Business Transaction Type
type: CBV Code Lists
comment: A document that includes the outcome of the execution of a given test procedure.
comment: Документ, содержащий результаты выполнения данной процедуры тестирования. @ru
label: результат теста @ru
term status: stable

Business Step ID
type: Class
comment: These identifiers populate the bizStep field in an EPCIS event.
comment: Типовые бизнес шаги любого события EPCIS. @ru
label: Бизнес-шаги @ru
subclass of: CBV Code Lists
term status: stable

accepting
type: NamedIndividual
type: Business Step ID
type: CBV Code Lists
comment: 12121212121 @ru
comment: Denotes a specific activity within a business process where an object changes possession and/or ownership.
comment: Обозначает определенное действие в рамках бизнес-процесса, когда объект меняет владение и/или права собственности. @ru
label: принятие @ru
term status: stable
example: Retailer X unloads a pallet on to the receiving dock. The numbers of cases on the pallet are counted. The pallets are disaggregated from the shipping conveyance. The quantity is verified against the delivery document (Freight Bill or Bill of Lading), notating any over, short or damaged product at the time of delivery. Typically this process releases freight payment and completes the contractual agreement with the carrier of delivering the product/assets to a specified location. A parcel carrier drops off five boxes at Distributor Y's DC. A person on the Receiving Dock signs that they accept the five boxes from the parcel carrier. A wholesaler is assigned a lot of fish at a fish auction, verifies the quantity and acknowledges receipt. A manufacturer's fork lift driver scans the IDs of components which have been removed from a consignment warehouse. In doing so, the components are added to the manufacturer's inventory.

arriving
type: NamedIndividual
type: Business Step ID
type: CBV Code Lists
comment: Denotes a specific activity within a business process where an object arrives at a location.
comment: Обозначает определенное действие в рамках бизнес-процесса, когда объект прибывает в место назначения. @ru
label: прибытие @ru
term status: stable
example: Truckload of a shipment arrives into a yard. Shipment has not yet been received or accepted.

assembling
type: NamedIndividual
type: Business Step ID
type: CBV Code Lists
comment: Denotes an activity within a business process whereby one or more objects are combined to create a new finished product. In contrast to transformation, in the output of `assembling` the original objects are still recognisable and/or the process is reversible; hence, `assembling` would be used preferably in an Association Event or, alternatively, an Aggregation Event, but not a Transformation Event.
comment: Обозначает определенное действие в рамках бизнес-процесса, при котором один или более объектов комбинируются, чтобы создать новый конечный продукт. В отличие от преобразования, на выходе сборки исходные объекты по-прежнему узнаваемы и/или процесс является обратимым; следовательно, сборка будет использоваться в Событии Агрегации, а не в Событии Трансформации. @ru
label: сборка @ru
term status: stable
example: Computer parts (hard drive, battery, RAM) assembled into a consumer ready computer MRO processes involving components added to an assembly comprised of multiple parts. Healthcare kitting: a surgical kit including drug, syringe, and gauze are combined to create a new 'product': a *kit*.

collecting
type: NamedIndividual
type: Business Step ID
type: CBV Code Lists
comment: Denotes a specific activity within a business process where an object is picked up and collected for future disposal, recycling or re-used.
comment: Обозначает определенное действие в рамках бизнес-процесса, при котором объект выбирается и забирается для последующей реализации, утилизации или повторного использования. @ru
label: сбор @ru
term status: stable
example: An organisation picks up disposed consumer electronics in an end of life state from various different organisations. After the goods are picked up, they typically are brought back and received into a Collection Centre Rented or leased pallets are picked up and brought to a collection centre.

commissioning
type: NamedIndividual
type: Business Step ID
type: CBV Code Lists
comment: Process of associating an instance-level identifier (such as an EPC) with a specific object, or the process of associating a class-level identifier, not previously used, with one or more objects. A tag may have been encoded and applied in this step, or may have been previously encoded. `commissioning` is applied to this association of object and serialised identifier, regardless of industry/sector; it encompasses sector-specific process steps including, but not limited to: - catching (of fish), - harvesting (of fruit/vegetable), - picking (of fruit/vegetables), - producing (on an automated line), - slaughtering (of livestock). In the case of a class-level identifier, `commissioning` differs from `creating_class_instance` in that `commissioning` always indicates that this is the first use of the class-level identifier, whereas `creating_class_instance` does not specify whether the class-level identifier has been used before.
comment: Процесс соединения идентификатора уровня экземпляра (как EPC) с определенным объектом или процесс соединения идентификатора уровня класса (ранее не использованного) с одним объектом или несколькими объектами. На этом этапе метка/этикетка может быть закодирована и прикреплена или же она может быть закодирована предварительно. В случае идентификатора уровня класса ввод в эксплуатацию отличается от создания экземпляра класса (creating_class_instance) тем, что ввод в эксплуатацию всегда означает, что это первое использование идентификатора уровня класса, в то время как создание экземпляра класса (creating_class_instance) не уточняет, был ли идентификатор уровня класса использован ранее. @ru
label: ввод в эксплуатацию @ru
term status: stable
example: On a packaging line, an encoded EPC is applied to a case and associated to the product. An individual virtual document (e.g. digital coupon, digital voucher, etc.) is assigned an EPC. One hundred bottles of a particular batch of pharmaceutical product are produced, those being the first bottles of that batch to be produced. Sides of beef are transformed into individual packaged steaks. This may be an EPCIS 1.2 TransformationEvent if the input sides of beef are also tracked.

consigning
type: NamedIndividual
type: Business Step ID
type: CBV Code Lists
comment: Indicates the overall process of `staging_outbound`, `loading`, `departing`, and `accepting`. It may be used when more granular process step information is unknown or inaccessible. The use of `consigning` is mutually exclusive from the use of `staging_outbound`, `loading`, `departing`, and `accepting`. Note: This business step is similar to `shipping`, but includes a change of possession and/or ownership at the outbound side.
comment: Обозначает общий процесс размещения в сектор приемки/отправки грузов (staging_outbound), погрузки (loading), отправки (departing) и принятия (accepting). Он может быть использован, когда более подробная информация об этапе процесса неизвестна или недоступна. Использование передачи (consigning) является взаимоисключающим с использованием значений размещения в сектор приемки/отправки грузов (staging_outbound), погрузки (loading), отправки (departing) и принятия (accepting). Примечание: данный этап бизнес-процесса схож с этапом отправка (shipping), но включает в себя также смену владения и/или права собственности со стороны отправителя. @ru
label: передача @ru
term status: stable
example: A wholesaler comes aboard a fishing vessel, selects and buys boxes of fish, and brings them to his premises. A manufacturer retrieves components from a consignment warehouse for use in its assembly line. In the logical second of leaving the consignment warehouse, the components pass into the ownership of the manufacturer. A manufacturer stages products for loading, loads them into a container, the container is sealed, and the container departs. Ownership transfers to the receiver sometime during this overall process. If this is done in a single step, then business step `consigning` is used.

creating class instance
type: NamedIndividual
type: Business Step ID
type: CBV Code Lists
comment: Denotes a step in a business process where an instance or increased quantity of a class-level identifier is produced. Unlike `commissioning`, this business step may be repeated for the same class-level identifier.
comment: Обозначает этап бизнес-процесса, на котором производится экземпляр или увеличенное количество идентификаторов уровня класса. В отличие от ввода в эксплуатацию (commissioning), этот этап бизнес-процесса может быть повторен для того же идентификатора уровня класса. @ru
label: создания экземпляра класса @ru
term status: stable
example: Water, sugar, and other ingredients are combined to produce a single batch of soda over a single shift on a single production line. This may be an EPCIS 1.2 `TransformationEvent` if the input ingredients are tracked. Potatoes are sorted by size and quality, washed, and packed into cases of a single lot in a single packaging facility on a single date.

cycle counting
type: NamedIndividual
type: Business Step ID
type: CBV Code Lists
comment: Process of counting objects within a location in order to obtain an accurate inventory for business needs other than accounting purposes (e.g., replenishment and allocation).
comment: Процесс подсчета объектов в пределах какого-либо места в целях получения точной инвентарной описи для бизнес-потребностей помимо целей бухгалтерского учета (например, пополнение и распределение). @ru
label: циклический переучет @ru
term status: stable
example: A preselected subset of objects (for instance, all products belonging to a certain brand owner or a specific object class) within a retail store, are counted by a handheld reader. All objects of a specific sub-location (sales floor or a shelf on the sales floor, e.g.) are counted by a handheld reader.

decommissioning
type: NamedIndividual
type: Business Step ID
type: CBV Code Lists
comment: Process of disassociating an instance-level identifier (such as an EPC) with an object. The object may be re-commissioned at some point in the future - however only with a new instance-level identifier.
comment: Процесс отделения идентификатора уровня экземпляра (например, EPC) от объекта. Объект может быть повторно запущен в эксплуатацию в какой-то момент в будущем, но только с новым идентификатором уровня экземпляра. @ru
label: вывод из эксплуатации @ru
term status: stable
example: An eSeal on a reusable container is broken when the container is opened, so that the container is no longer identified by the instance-level identifier that was in the eSeal. A digital coupon or an empties refund voucher is redeemed at retail point-of-sale.

departing
type: NamedIndividual
type: Business Step ID
type: CBV Code Lists
comment: Denotes a specific activity within a business process where an object leaves a location on its way to a destination.
comment: Обозначает определенное действие в рамках бизнес-процесса, при котором объект покидает какое-то место на пути к месту назначения. @ru
label: отправление @ru
term status: stable
example: Truckload of a shipment departs a yard, typically through a gate and begins transit to another location.

destroying
type: NamedIndividual
type: Business Step ID
type: CBV Code Lists
comment: Process of terminating an object. For an instance-level identifier, the object should not be the subject of subsequent events; subsequent events are likely indicative of error (such as a stray read of a tag inside an incinerator). For a class level identifier, quantities are reduced; however, the class-level identifier may still be used in subsequent events (referring to different instances that were not destroyed).
comment: Процесс ликвидации объекта. Для идентификатора уровня экземпляра объект не должен быть предметом последующих событий; дальнейшие события будут, скорее всего, указывать на ошибку (например, случайное считывание метки внутри установки для сжигания отходов). Что касается идентификатора уровня класса, его количество сокращается; однако идентификатор уровня класса все еще может быть использован в последующих событиях (относящихся к различным экземплярам, которые не были уничтожены). @ru
label: разрушение @ru
term status: stable
example: Distributor or Retailer puts empty case in the incinerator or box crusher.

disassembling
type: NamedIndividual
type: Business Step ID
type: CBV Code Lists
comment: Denotes a specific activity within a business process where an object is broken down into separate, uniquely identified component parts.
comment: Обозначает определенное действие в рамках бизнес-процесса, при котором объект разбивается на отдельные уникально идентифицируемые составные части. @ru
label: разборка @ru
term status: stable
example: Before feeding a consumer electronics end of life item (a computer) into recycling operation line, it is necessary to disassemble the parts for the purpose of being recycled or disposed of in an environmentally sound manner. A surgical kit (e.g. 2- 50 count bottles of medication and 1 syringe gauze) is broken down into its separate component parts.

dispensing
type: NamedIndividual
type: Business Step ID
type: CBV Code Lists
comment: Denotes a specific activity within a business process where a product is made available in full or part to a consumer.
comment: Обозначает конкретную деятельность в рамках бизнес-процесса, при которой продукт полностью или частично предоставляется потребителю. @ru
label: распределение @ru
term status: stable
example: A pharmacist dispenses a pharmaceutical to fill a specific prescription written by a physician, to a consumer or patient. A deli manager slices a 5 pound package of turkey for sale.

encoding
type: NamedIndividual
type: Business Step ID
type: CBV Code Lists
comment: Process of writing an instance-level identifier (typically an EPC) to a barcode or RFID tag, where the identifier is not yet associated with an object at this step in the process. Encoding SHOULD only be used in a `TransactionEvent`.
comment: Процесс написания идентификатора уровня экземпляра (обычно EPC) для штрихкода или RFID-метки, где идентификатор еще не связан с объектом на этом этапе процесса. @ru
label: кодирование @ru
term status: stable
example: 3rd Party writes tags and returns spool of case tags to Manufacturer.

entering / exiting
type: NamedIndividual
type: Business Step ID
type: CBV Code Lists
comment: Denotes a specific activity at the Entrance/Exit door of a facility where customers are either leaving with purchased product or entering with product to be returned to the facility.
comment: Обозначает определенное действие входа / выхода из объекта, при котором клиенты либо выходят с приобретенным продуктом, либо входят с продуктом, который должен быть возвращен на объект. @ru
label: вход / выход @ru
term status: stable
example: Customer leaves the facility of Retailer X with their purchased items through a customer entrance/exit door.

holding
type: NamedIndividual
type: Business Step ID
type: CBV Code Lists
comment: Denotes a specific activity within a business process where an object is segregated for further review.
comment: Обозначает определенное действие в рамках бизнес-процесса, при котором объект отделяется для дальнейшего рассмотрения. @ru
label: удержание / временное хранение до принятия решения по объекту @ru
term status: stable
example: Retailer X unloads a second pallet on to their receiving dock, and, finding no purchase order for the pallet, moves the pallet to a holding area on the dock. Distributor Y obtains a shipment of pharmaceutical product. Distributor Y finds that their supplier cannot provide a complete pedigree. Distributor Y moves the shipment to a quarantine area on their dock. Shipper Z is told by Customs to move a container to a special area until Customs can inspect and clear the container.

inspecting
type: NamedIndividual
type: Business Step ID
type: CBV Code Lists
comment: Process of reviewing objects to address potential physical or documentation defects. In contrast to *sampled* objects, *inspected* objects **remain viable** in the supply chain. `inspecting` is non-destructive and typically only checks the plausibility of the product packaging, security devices (e.g. holograms, watermarks, etc.) and integrity of any tamper-evident seals, whereas `sampling` is always destructive, i.e., makes the sampled product instance no longer viable for sale or onward distribution in the retail/dispensing supply chain).
comment: Процесс осмотра объектов с целью устранения потенциальных физических дефектов или погрешностей в документации. @ru
label: осмотр @ru
term status: stable
example: Manufacturer A pulls 10 bottles from every batch to ensure that the product and pill count in the bottles match expectations. Distributor Y checks all returned products to designate them either as saleable or as damaged. Regulator R pulls 3 bottles from a shelf to determine if the bottles have a correct pedigree. Customs Agent C uses a machine to scan the contents of a shipping container. Pallet pool operator Z checks if certain pallets comply with quality standards.

installing
type: NamedIndividual
type: Business Step ID
type: CBV Code Lists
comment: Denotes a specific activity within a business process where an object is put into a composite object (not merely a container). In `installing` the composite object exists prior to this step, whereas in `assembling` the composite object is created during the step.
comment: Обозначает определенное действие в рамках бизнес-процесса, при котором объект помещается в составной объект (а не просто в контейнер). При монтаже (installing) составной объект уже существует до этой стадии, тогда как при сборке (assembling) составной объект создается во время самой стадии. @ru
label: инсталляция / установка @ru
term status: stable
example: Additional memory chips and a rechargeable battery are installed within a computer A duplexing unit is installed on a laser printer Additional safety equipment is installed within the cabin of an aircraft or vehicle (e.g. fire extinguishers)

killing
type: NamedIndividual
type: Business Step ID
type: CBV Code Lists
comment: Process of terminating an RFID tag previously associated with an object. The object and its instance-level identifier may continue to exist and be the subject of subsequent events (via a barcode, manual data entry, replacement tag, etc.).
comment: Процесс прекращения использования RFID-метки, ранее связанной с объектом. Объект и его идентификатор уровня экземпляра может продолжать существовать и быть предметом последующих событий (с помощью штрихкода, ручного ввода данных, замены этикетки и т.д.). @ru
label: отключение @ru
term status: stable
example: Kill Command is issued to the tag to prevent any further reading of the tag or the information on the tag.

loading
type: NamedIndividual
type: Business Step ID
type: CBV Code Lists
comment: Denotes a specific activity within a business process where an object is loaded into shipping conveyance.
comment: Обозначает определенное действие в рамках бизнес-процесса, когда объект загружается в транспортное средство для доставки @ru
label: погрузка @ru
term status: stable
example: Manufacturer A loads pallets into a container. The pallets are aggregated to the container. Distributor Y loads racks full of totes on to a truck.

other
type: NamedIndividual
type: Business Step ID
type: CBV Code Lists
comment: A business step not identified by any of the values listed in the CBV.
comment: Этап бизнес-процесса, не идентифицируемый ни одним из значений, перечисленных в основном словаре бизнес-лексики (деловой лексики). @ru
label: другое @ru
term status: stable
example: `other` may be used for terms that have yet to be added to the CBV from an industry or a user.

packing
type: NamedIndividual
type: Business Step ID
type: CBV Code Lists
comment: Denotes a specific activity within a business process that includes putting objects into a larger container - usually for shipping. Aggregation of one unit to another typically occurs at this point.
comment: Обозначает определенное действие в рамках бизнес-процесса, которое включает в себя помещение объектов в емкости большего объема - например, для отправки. Как правило, на данном этапе имеет место объединение блоков друг с другом. @ru
label: упаковка / фасовка @ru
term status: stable
example: 12 packs of soda are placed into a case. Loose potatoes are placed into a tote.

picking
type: NamedIndividual
type: Business Step ID
type: CBV Code Lists
comment: Denotes a specific activity within a business process that includes the selecting of objects to fill an order.
comment: Обозначает определенное действие в рамках бизнес-процесса, которое включает в себя выбор объектов, необходимых для выполнения заказа. @ru
label: отбор @ru
term status: stable
example: Distributor Y places three units into a tote to meet the requirements of a purchase order. Manufacturer A pulls three pallets from its racks to fulfil a purchase order.

receiving
type: NamedIndividual
type: Business Step ID
type: CBV Code Lists
comment: Denotes a specific activity within a business process that indicates that an object is being received at a location and is added to the receiver's inventory. The use of `receiving` is mutually exclusive from the use of `arriving` and `accepting`.
comment: Обозначает определенное действие в рамках бизнес-процесса, которое указывает, что объект принимается в каком-то месте и добавляется к товарно-материальным ценностям получателя. Использование получения (receiving) является взаимоисключающим с использованием прибытия (arriving) и принятия (accepting). @ru
label: получение @ru
term status: stable
example: Retailer X confirms that the count of cases on the pallet equals the expected count in a purchase order. Retailer X takes the cases into inventory. Typically, this process matches the product to the purchase order for payment to the supplier. A shipment from a manufacturer factory site to manufacturer distribution centre, is matched against the transaction record then added to local inventory.

removing
type: NamedIndividual
type: Business Step ID
type: CBV Code Lists
comment: Denotes a specific activity within a business process where an object is taken out of a composite object. Opposite of `installing`.
comment: Обозначает определенное действие в рамках бизнес-процесса, при котором объект извлекается из составного объекта. @ru
label: демонтаж/извлечение @ru
term status: stable
example: A defective airplane part is taken out of the engine.

repackaging
type: NamedIndividual
type: Business Step ID
type: CBV Code Lists
comment: Denotes a specific activity within a business process where an object's packaging configuration is changed.
comment: Обозначает определенное действие в рамках бизнес-процесса, при котором изменяется конфигурация упаковки объекта. @ru
label: перепаковка @ru
term status: stable
example: Distributor Y receives one box full of batteries and another box full of laptops without batteries. Distributor Y ships out new boxes containing one laptop and one battery.

repairing
type: NamedIndividual
type: Business Step ID
type: CBV Code Lists
comment: Denotes a specific activity within a business process where a malfunctioning product is repaired (typically by a post-sales service), without replacing it by a new one.
comment: Обозначает определенное действие в рамках бизнес-процесса, при котором неисправный продукт ремонтируется (как правило, в рамках послепродажного обслуживания), без замены его на новый продукт. @ru
label: починка @ru
term status: stable
example: A computer is brought to a repair centre to fix a problem. An airplane part is in maintenance centre to diagnose an issue.

replacing
type: NamedIndividual
type: Business Step ID
type: CBV Code Lists
comment: Denotes a specific activity within a business process where an object is substituted or exchanged for another object.
comment: Обозначает определенное действие в рамках бизнес-процесса, при котором объект заменяется или обменивается на другой объект. @ru
label: замена @ru
term status: stable
example: A defective airplane part is replaced by a new part.

reserving
type: NamedIndividual
type: Business Step ID
type: CBV Code Lists
comment: Process in which a set of instance-level identifiers, not yet commissioned, are provided for use by another party.
comment: Процесс, при котором набор идентификаторов уровня экземпляра, пока не введенных в эксплуатацию, предоставляется для использования другой стороной. @ru
label: резервирование @ru
term status: stable
example: Manufacturer provides set of case EPC numbers to a 3rd Party labeller.

retail selling
type: NamedIndividual
type: Business Step ID
type: CBV Code Lists
comment: Denotes a specific activity within a business process at a point-of-sale for the purpose of transferring ownership to a customer in exchange for something of value (currency, credit, etc.).
comment: Обозначает определенное действие в рамках бизнес-процесса в торговой точке с целью передачи права собственности клиенту в обмен на что-то ценное (деньги, кредит и т.д.). @ru
label: розничная продажа @ru
term status: stable
example: Retailer X sells a screwdriver to a customer by checking it out through a point-of-sale system.

sampling
type: NamedIndividual
type: Business Step ID
type: CBV Code Lists
comment: Denotes a testing activity within a business process where one or more portions of an object are examined for quality testing, quality inspection, or customs clearance purposes. In contrast to *inspected* objects, *sampled* objects are **no longer viable** in the supply chain. `inspecting` is non-destructive and typically only checks the plausibility of the product packaging, security devices (e.g. holograms, watermarks, etc.) and integrity of any tamper-evident seals, whereas `sampling` is always destructive, i.e., makes the sampled product instance no longer viable for sale or onward distribution in the retail/dispensing supply chain). When a serialised instance undergoes `sampling`, the subsequent business step SHALL be an end-of-life event (i.e., with action DELETE), to prevent the return of the sampled object (or its identifier) into the supply chain.
comment: Обозначает деятельность по тестированию в рамках бизнес-процесса, при которой одна или несколько частей объекта проверяются для проверки качества или таможенного оформления. В отличие от проверенных (inspected) объектов, выбранные (sampled) объекты "больше не являются жизнеспособными" (no longer viable) в цепочке поставок. Проверка не повреждает упаковку и обычно проверяет только ее надежность, защитные устройства (например, голограммы, водяные знаки и т.д.) и целостность любых пломб, защищающих от недопустимого вскрытия, в то время как отбор проб (sampling)всегда разрушителен, т.е. делает отобранный экземпляр продукта более непригодным для продажи или дальнейшего использования. распределение в розничной/распределительной цепочке поставок). Когда экземпляр подвергается "выборке", последующим бизнес-шагом должно быть быть событие окончания срока службы (т.е. с действием DELETE), чтобы предотвратить возврат отобранного объекта (или его идентификатора) в цепочку поставок. @ru
label: отбор проб @ru
term status: stable
example: Customs authority X removes a pharmaceutical product from a case for quality testing at a customs office. Food laboratory Y pulls a random product sample and checks it for authenticity.

sensor reporting
type: NamedIndividual
type: Business Step ID
type: CBV Code Lists
comment: Denotes a specific activity within a business process where sensor data, pertaining to the physical properties and condition of an object or location, is returned. If an EPCIS event accommodates sensor data in conjunction with specific business process steps (e.g. sensor observations in the context of a `commissioning`, `packing`, or `sampling`), the business step value describing the process step SHOULD be used. `sensor_reporting` SHOULD only be used when no other business step is in progress.
comment: Обозначает конкретное действие в рамках бизнес-процесса, при котором возвращаются данные датчиков, относящиеся к физическим свойствам и состоянию объекта или местоположения. Если событие EPCIS включает данные датчиков в сочетании с конкретными этапами бизнес-процесса (например, наблюдения датчиков в контексте "ввода в эксплуатацию", "упаковки" или "отбора проб"), следует использовать значение бизнес-шага, описывающее этап процесса. Отчет датчиков нужно использовать только тогда, когда не выполняется никакой другой бизнес-шаг. @ru
label: отчет датчиков @ru
term status: stable
example: Several packages of frozen food are kept in cold storage, with temperature monitoring. An EPCIS event is triggered once a specific, pre-set temperature threshold is reached. A dust-free room is continuously checked for the presence of contaminants. An EPCIS event is captured at regular intervals for documentation purposes. A wine/cheese cellar is continuously checked for absolute humidity and temperature. Each time the door is opened or closed, an EPCIS event is captured, including the range of temperature and absolute humidity values within the period of time since the previously captured `commissioning` EPCIS event.

shipping
type: NamedIndividual
type: Business Step ID
type: CBV Code Lists
comment: Indicates the overall process of `staging_outbound`, `loading` and `departing`. It may be used when more granular process step information is unknown or inaccessible. It may indicate a final event from a shipping point. The use of `shipping` is mutually exclusive from the use of `staging_outbound`, `departing`, or `loading`.
comment: Обозначает общий процесс размещения в сектор приемки/отправки грузов погрузку и отправление. Он может быть использован, когда более подробная информация об этапе процесса неизвестна или недоступна. Может обозначать заключительное событие в точке отправки. Использование отправки (shipping) является взаимоисключающим с использованием значений размещения в сектор приемки/отправки грузов (staging_outbound), погрузки (loading) или отправки (departing). @ru
label: отправка @ru
term status: stable
example: Manufacturer A loads and reads product into the shipping container and closes the door. The product has been read out of the shipping facility. The shipment is immediately picked up and a BOL is associated at this point. (The shipment has left the yard) At Distributor Y, the truck containing racks full of totes pulls away from the shipping dock or staging area. Manufacturer A completes loading product into trailer and seals door. The trailer is ready for pickup. The generation of a Despatch Advice / ASN triggers a `shipping` event. A 3PL picks and tags the product. The product is loaded into a trailer and signed over to a transportation carrier. The 3PL notifies the manufacturer who generates a `shipping` event. NOTE: This would be the case if there were NO departing step at a read point at the gate. Typical Process flow: - `staging_outbound` - `loading` - `departing` The above steps assume an organisation's ability and desire to share all steps in the process. If those process steps are not captured, the single business step of `shipping` would be used.

staging outbound
type: NamedIndividual
type: Business Step ID
type: CBV Code Lists
comment: Denotes a specific activity within a business process in which an object moves from a facility to an area where it will await transport pick-up.
comment: Обозначает определенное действие в рамках бизнес-процесса, при котором объект перемещается из сооружения/помещения в зону, где он будет ожидать погрузки на средство транспортировки. @ru
label: размещение в сектор приемки/отправки грузов @ru
term status: stable
example: Container is being closed and will be subsequently loaded onto a vehicle in the yard. Container is being closed and seal is applied, and will be subsequently loaded onto a vehicle in the yard. Product has been picked and is now in a staging lane waiting for loading into a container.

stock taking
type: NamedIndividual
type: Business Step ID
type: CBV Code Lists
comment: Process of counting objects within a location following established rules and/or standards to serve as a basis for accounting purposes.
comment: Процесс подсчета объектов в пределах какого-то места, который осуществляется согласно установленным правилам и/или стандартам, и результат которого используется для целей бухгалтерского учета. @ru
label: инвентаризация @ru
term status: stable
example: All EPCs in a retail store are read by a handheld reader following a procedure accepted by the organisation’s accounting firm.

stocking
type: NamedIndividual
type: Business Step ID
type: CBV Code Lists
comment: Denotes a specific activity within a business process within a location to make an object available to the customer or for order fulfilment within a DC.
comment: Обозначает определенное действие в рамках бизнес-процесса в пределах какого-то места, цель которого - сделать объект доступным для клиента или для выполнения заказа в пределах центра распределения. @ru
label: cоздание товарных запасов @ru
term status: stable
example: Retailer X places cans from a case on to a shelf on the sales floor. Dist X moves goods from a storage area to a picking area.

storing
type: NamedIndividual
type: Business Step ID
type: CBV Code Lists
comment: Denotes a specific activity within a business process where an object is moved into and out of storage within a location.
comment: Обозначает определенное действие в рамках бизнес-процесса, при котором объект перемещается в и из хранилища в пределах определенного места. @ru
label: хранение/складирование @ru
term status: stable
example: Manufacturer A moves a pallet from the receiving area to a rack Retailer X moves a case from the receiving dock to a shelf in the backroom.

transporting
type: NamedIndividual
type: Business Step ID
type: CBV Code Lists
comment: Process of moving an object from one location to another using a vehicle (e.g., a ship, a train, a lorry, an aircraft).
comment: Процесс перемещения объекта из одного места в другое с помощью транспортного средства (например, корабля, поезда грузовика самолета). @ru
label: транспортировка @ru
term status: stable
example: Carrier X conveys 150 sea containers from Hong Kong seaport to Hamburg seaport with a container vessel. A train with 20 goods wagons goes from one train station to another. A lorry moves a swap trailer from a depot to a distribution centre.

unloading
type: NamedIndividual
type: Business Step ID
type: CBV Code Lists
comment: Denotes a specific activity within a business process where an object is unloaded from a shipping conveyance.
comment: Обозначает определенное действие в рамках бизнес-процесса, когда объект выгружается из транспортного средства, на котором он был доставлен. @ru
label: разгрузка @ru
term status: stable
example: Manufacturer A unloads pallets from a shipping conveyance. The pallets are disaggregated from the shipping conveyance. Distributor Y unloads racks full of totes from a truck.

unpacking
type: NamedIndividual
type: Business Step ID
type: CBV Code Lists
comment: Denotes a specific activity within a business process that includes removing products (individuals, inners, cases, pallets) from a larger container - usually after receiving or accepting. Disaggregation of one unit from another typically occurs at this point.
comment: Обозначает определенное действие в рамках бизнес-процесса, которое включает в себя изъятие продуктов (отдельные предметы, вкладыши, ящики, поддоны) из емкости большего объема - как правило, после получения или принятия. На данном этапе имеет место отделение одной единицы от другой. @ru
label: распаковка @ru
term status: stable
example: 12 packs of soda are removed from a case. Loose potatoes are taken off from a tote.

void shipping
type: NamedIndividual
type: Business Step ID
type: CBV Code Lists
comment: Denotes a process of declaring that one or more objects in a prior outbound process (captured in an EPCIS event having business step `shipping`, `departing`, or `consigning`) were not shipped (or departed or consigned) as previously indicated.
comment: Обозначает процесс объявления о том, что один или несколько объектов в предыдущем исходящем процессе (захваченных в событии EPCIS, имеющем бизнес-этап "отправка", "отправление" или "отправка") не были отправлены (или отправлены или отправлены), как указано ранее. @ru
label: недействительная (неосущесвленная) доставка @ru
term status: stable
example: A sender cancels a shipment after a prior shipping event. A sender discovers, either by notification from a recipient or on their own, that a shipment they believed occurred and created a shipping event for, did not actually occur. The record is updated to reflect this. A sender discovers that three out of ten items, previously believed as having been shipped, were not included in the shipment. The `voidShipping` event indicates that those three items were not shipped.

CBV Code Lists
type: Class
comment: Core Business vocabulary (CBV) Code lists
comment: Списки справочников стандарта CBV. @ru
label: Справочники CBV @ru
subclass of: CBV

Component
type: Class
comment: These identifiers may be used to populate the type attribute of a component element in the SensorReport of an EPCIS event.
comment: Эти идентификаторы могут использоваться для заполнения атрибута типа элемента компонента в отчете датчика о событии EPCIS.
label: Компоненты @ru
subclass of: CBV Code Lists
term status: stable

altitude
type: NamedIndividual
type: CBV Code Lists
type: Component
comment: The height above a defined surface (such as mean sea level) in a geographic coordinate system
comment: Высота над определенной поверхностью (например, средний уровень моря) в географической системе координат @ru
label: высота (в географической системе координат) @ru
term status: stable

axial distance
type: NamedIndividual
type: CBV Code Lists
type: Component
comment: Radial distance from the cylindrical axis in a cylindrical polar coordinate system; the magnitude of the projection of the vector in the plane perpendicular to the cylindrical axis
comment: Радиальное расстояние от цилиндрической оси в цилиндрической полярной системе координат; величина проекции вектора в плоскости, перпендикулярной цилиндрической оси. @ru
label: осевое расстояние @ru
term status: stable

azimuth
type: NamedIndividual
type: CBV Code Lists
type: Component
comment: Angle measured in the XY plane, anticlockwise from the X axis (in cylindrical or spherical polar coordinate systems) to the plane containing the vector and the Z axis
comment: Угол, измеренный в плоскости XY против часовой стрелки от оси X (в цилиндрической или сферической полярных системах координат) к плоскости, содержащей вектор и ось Z. @ru
label: азимут @ru
term status: stable

easting
type: NamedIndividual
type: CBV Code Lists
type: Component
comment: A component or projection along an east-pointing axis in a geographic Cartesian coordinate system
comment: Компонент или проекция вдоль оси, направленной на восток, в географической декартовой системе координат. @ru
label: на восток @ru
term status: stable

elevation angle
type: NamedIndividual
type: CBV Code Lists
type: Component
comment: Angle measured from the XY plane to the vector in a spherical polar coordinate system
comment: Угол, измеренный от плоскости XY до вектора в сферической полярной системе координат. @ru
label: угол возвышения @ru
term status: stable

geocoordinate
type: NamedIndividual
type: CBV Code Lists
type: Component
comment: RFC5870-compliant geographic location URI expressed via the uriValue field
comment: URI географического местоположения, соответствующий стандарту RFC5870, выраженный через поле значения uri. @ru
label: геопозиция @ru
term status: stable

height
type: NamedIndividual
type: CBV Code Lists
type: Component
comment: Height parallel to the cylindrical axis in a cylindrical polar coordinate system, above a defined reference origin plane (typically the XY plane)
comment: Высота, параллельная цилиндрической оси в цилиндрической полярной системе координат, над определенной исходной плоскостью (обычно плоскостью XY) @ru
label: высота (в цилиндрической полярной системе координат) @ru
term status: stable

latitude
type: NamedIndividual
type: CBV Code Lists
type: Component
comment: The angle of elevation from the equatorial plane in a geographic coordinate system
comment: Угол возвышения от экваториальной плоскости в географической системе координат @ru
label: широта @ru
term status: stable

longitude
type: NamedIndividual
type: CBV Code Lists
type: Component
comment: The angle (measured within the equatorial plane) to the east of the prime meridian in a geographic coordinate system
comment: Угол (измеренный в экваториальной плоскости) к востоку от нулевого меридиана в географической системе координат @ru
label: долгота @ru
term status: stable

northing
type: NamedIndividual
type: CBV Code Lists
type: Component
comment: A component or projection along a north-pointing axis in a geographic Cartesian coordinate system
comment: Компонент или проекция вдоль оси, направленной на север, в географической декартовой системе координат @ru
label: на север @ru
term status: stable

polar angle
type: NamedIndividual
type: CBV Code Lists
type: Component
comment: Angle measured from the Z axis to the vector in a spherical polar coordinate system
comment: Угол, измеренный от оси Z до вектора в сферической полярной системе координат @ru
label: полярный угол @ru
term status: stable

spherical radius
type: NamedIndividual
type: CBV Code Lists
type: Component
comment: Radial distance from the centre of a sphere in a spherical polar coordinate system; the magnitude of the vector
comment: Радиальное расстояние от центра сферы в сферической полярной системе координат; величина вектора @ru
label: сферический радиус @ru
term status: stable

x coordinate
type: NamedIndividual
type: CBV Code Lists
type: Component
comment: Component or projection along the x axis in Cartesian coordinates (X,Y,Z)
comment: Компонент или проекция вдоль оси x в декартовых координатах (X,Y,Z) @ru
label: координата x @ru
term status: stable

y coordinate
type: NamedIndividual
type: CBV Code Lists
type: Component
comment: Component or projection along the y axis in Cartesian coordinates (X,Y,Z)
comment: Компонент или проекция вдоль оси y в декартовых координатах (X,Y,Z) @ru
label: координата y @ru
term status: stable

z coordinate
type: NamedIndividual
type: CBV Code Lists
type: Component
comment: Component or projection along the z axis in Cartesian coordinates (X,Y,Z)
comment: Компонент или проекция вдоль оси z в декартовых координатах (X,Y,Z) @ru
label: координата z @ru
term status: stable

Disposition ID
type: Class
comment: These identifiers populate the disposition or persistentDisposition fields in an EPCIS event.
comment: Эти идентификаторы заполняют поля disposition или persistent Disposition в событии EPCIS. @ru
label: Диспозиции @ru
subclass of: CBV Code Lists
term status: stable

active
type: NamedIndividual
type: CBV Code Lists
type: Disposition ID
comment: A commissioned object has just been introduced into the supply chain.
comment: Введенный в эксплуатацию объект был только что включен в цепочку поставок. @ru
label: активен @ru
term status: stable
example: Manufacturer A commissions tags for 10 cases of product. A virtual document has been assigned an EPC Business step: - `commissioning`

available
type: NamedIndividual
type: CBV Code Lists
type: Disposition ID
comment: Object has been returned to service or to the supply chain (e.g., following a successfully completed `repairing` step).
comment: Объект был возвращен в эксплуатацию или в цепочку поставок (например, после успешно завершенного этапа починки). @ru
label: доступный @ru
term status: stable
example: A mechanical component has been serviced and made available for use.

completeness inferred
type: NamedIndividual
type: CBV Code Lists
type: Disposition ID
comment: Applied as `persistentDisposition` of an `AggregationEvent` or `ObjectEvent` with action `OBSERVE` to indicate the **inferred** integrity of that aggregation (without unpacking the aggregated children from the parent) on the basis of aggregation information (e.g., earlier EPCIS packing event data and/or ASN/DESADV) provided by an upstream supplier. Inferred children SHALL be explicitly listed when captured in an `AggregationEvent`, but SHALL NOT be listed when captured in an `ObjectEvent`.
comment: Применяется как "persistentDisposition" для "AggregationEvent" или "ObjectEvent" с действием "НАБЛЮДАТЬ", чтобы указать предполагаемую целостность этой агрегации (без распаковки агрегированных дочерних элементов из родительского) на основе информации об агрегировании (например, более ранние данные о событиях упаковки EPCIS и /или ASN/DESADV), предоставленный вышестоящим поставщиком. Предполагаемые дочерние элементы ДОЛЖНЫ быть явно перечислены при захвате в `AggregationEvent`, но НЕ ДОЛЖНЫ быть перечислены при захвате в `ObjectEvent`. @ru
label: предполагаемая комплектность @ru
term status: stable
example: A downstream recipient *infers* that the contents of a shipment below the outer packing layer are complete, as indicated in EPCIS packing and shipping events provided by the upstream supplier.

completeness verified
type: NamedIndividual
type: CBV Code Lists
type: Disposition ID
comment: Applied as `disposition` of an `AggregationEvent` with action `DELETE` and business step `unpacking` to explicitly indicate the verified integrity of that aggregation when the aggregated children are unpacked from their parent. Applied as `persistentDisposition` of an `ObjectEvent` with business step `inspecting`, if the inspection has verified the presence of each of the aggregated children.
comment: Применяется как `удаление" "AggregationEvent" с действием "УДАЛИТЬ" и бизнес-шагом "распаковка", чтобы явно указать проверенную комплектность этой агрегации, когда агрегированные дочерние элементы распаковываются из их родительского элемента. Применяется как "Постоянное расположение" объекта "Событие` с бизнес-шагом `проверка", если проверка подтвердила наличие каждого из агрегированных дочерних элементов. @ru
comment: верифицированная комплектность @ru
term status: stable
example: A downstream recipient *verifies* that the contents of a shipment below the outer packing layer are complete, by means of unpacking and scanning the barcodes or EPC/RFID tags of the contents.

conformant
type: NamedIndividual
type: CBV Code Lists
type: Disposition ID
comment: Outcome of a successful/passed inspection in an `inspecting` or `repairing` step.
comment: Результат успешной/пройденной проверки на этапе осмотра или починки. @ru
label: соответствующий (согласованный) @ru
term status: stable
example: A mechanical component has been successfully tested for conformity to safety or performance requirements.

container closed
type: NamedIndividual
type: CBV Code Lists
type: Disposition ID
comment: Object has been loaded onto a container, the doors have been closed and the shipment sealed.
comment: Объект был загружен в контейнер, двери были закрыты, и партия груза опечатана.. @ru
label: контейнер закрыт @ru
term status: stable
example: Container is being closed and will be awaiting pickup in the yard. Container is being closed and electronic seal is applied. Business step (non-exclusive example): - `staging_outbound`

container open
type: NamedIndividual
type: CBV Code Lists
type: Disposition ID
comment: A container's doors have been opened; or a seal of a shipment has been broken. This disposition makes no indication as to whether the act of opening was authorised.
comment: Двери контейнера были открыты; или пломба груза была сломана. Это распоряжение не содержит никаких указаний на то, был ли акт вскрытия санкционирован. @ru
label: контейнер открыт @ru
term status: stable
example: Container has been opened in the normal process of unloading. Container has been opened unexpectedly, with no apparent reason.

damaged
type: NamedIndividual
type: CBV Code Lists
type: Disposition ID
comment: Object is impaired in its usefulness and/or reduced in value due to a defect.
comment: Объект теряет свою полезность и/или снижается в стоимости из-за дефекта. @ru
label: поврежденный @ru
term status: stable
example: Pallet pool operator P notices that a plank of a pallet is broken and records this incident by scanning the EPC of the pallet. Retailer R receives a shipment where the product packages on the pallet have been dented. Business steps: - `accepting` - `inspecting` - `receiving` - `removing` - `repairing` - `replacing` Note: `damaged` can also apply to non-apparent (physical) damage determined by means of sensor data. For example, product pH has dropped beyond a minimum acceptable threshold for viability.

destroyed
type: NamedIndividual
type: CBV Code Lists
type: Disposition ID
comment: Object has been fully rendered non-usable.
comment: Объект был полностью приведен в непригодное для использования состояние. @ru
label: разрушен @ru
term status: stable
example: Incinerator Operator B indicates that product and packaging have been incinerated. Business step: - `destroying`

dispensed
type: NamedIndividual
type: CBV Code Lists
type: Disposition ID
comment: A full quantity of product is distributed to a consumer.
comment: Потребителю выдается полное количество продукта. @ru
label: распределенный (выданный) @ru
term status: stable
example: A pharmacist dispenses a pharmaceutical in a container’s totality to fill a specific prescription written by a physician, to a consumer or patient. A deli manager slices the complete contents of a 5 pound package of turkey for sale. NOTE: this disposition reflects the disposition of the original object, not what was dispensed.

disposed
type: NamedIndividual
type: CBV Code Lists
type: Disposition ID
comment: Object has been returned for disposal.
comment: Объект был возвращен для утилизации. @ru
label: уничтожен @ru
term status: stable
example: A package of pharmaceuticals has been picked up by a distributor and will be subsequently destroyed.

encoded
type: NamedIndividual
type: CBV Code Lists
type: Disposition ID
comment: An instance-level identifier has been written to a barcode or RFID tag, but not yet commissioned.
comment: Идентификатор уровня экземпляра записан на этикетку со штрихкодом или RFID-метку, но еще не введен в эксплуатацию. @ru
label: закодирован @ru
term status: stable
example: 3rd Party has written EPCs to tags and returns spool of case tags to Manufacturer. Business step: - `encoding`

expired
type: NamedIndividual
type: CBV Code Lists
type: Disposition ID
comment: Object's expiration date is in the past.
comment: Объект, у которого истек срок годности. @ru
label: просроченный @ru
term status: stable
example: Distributor Y indicates that a product is past its expiration date Business step (examples): - `holding` - `staging_outbound` - `storing`

in progress
type: NamedIndividual
type: CBV Code Lists
type: Disposition ID
comment: Optional disposition for object proceeding through points in the supply chain.
comment: Диспозиция по умолчанию для объекта проходящего через точки в цепочке поставок. @ru
label: в процессе обработки @ru
term status: stable
example: Note: *Omission* of disposition is generally recommended instead of `in_progress`, which adds little value to event data.

in transit
type: NamedIndividual
type: CBV Code Lists
type: Disposition ID
comment: Object being shipped between two trading partners.
comment: Объект, отправляемый между двумя торговыми партнерами. @ru
label: в пути @ru
term status: stable
example: Shipper Z pulled a container/product out of a manufacturer’s yard on to a road. Business step: - `shipping` - `departing`

inactive
type: NamedIndividual
type: CBV Code Lists
type: Disposition ID
comment: Decommissioned object that may be reintroduced to the supply chain.
comment: Выведенный из эксплуатации объект, который может быть вновь введен в цепочку поставок. @ru
label: неактивный @ru
term status: stable
example: A reusable tag is removed from a reusable transport item. A digital coupon or an empties refund voucher has been redeemed at retail point-of-sale. Business step: - `decommissioning`

mismatch class
type: NamedIndividual
type: CBV Code Lists
type: Disposition ID
comment: Class-level identifiers do not correspond to the identifiers that were expected.
comment: Идентификаторы уровня класса не соответствуют ожидаемым. @ru
label: класс несоответствия @ru
term status: stable
example: Recipient unpacks 10 of expected 10, but GTINs do not match data communicated via the EPCIS Packing event provided by the supplier. Note: It is recommended to capture all `mismatch_` dispositions as persistentDisposition.

mismatch instance
type: NamedIndividual
type: CBV Code Lists
type: Disposition ID
comment: Instance-level identifiers do not correspond to the identifiers that were expected.
comment: Идентификаторы уровня экземпляра не соответствуют ожидаемым. @ru
label: экземпляр несоответствия @ru
term status: stable
example: Recipient unpacks 10 of expected 10, but SGTINs do not match data communicated via the EPCIS Packing event provided by the supplier. Note: It is recommended to capture all `mismatch_` dispositions as persistentDisposition.

mismatch quantity
type: NamedIndividual
type: CBV Code Lists
type: Disposition ID
comment: Quantity do not correspond to the quantity that was expected.
comment: Количество не соответствует ожидаемому. @ru
label: количество несоответствий @ru
term status: stable
example: Recipient unpacks 9 of expected 10 (an 'underage'), or 11 of expected 10 (an 'overage'). Note: It is recommended to capture all `mismatch_` dispositions as persistentDisposition.

needs replacement
type: NamedIndividual
type: CBV Code Lists
type: Disposition ID
comment: Component(s) or other asset(s) must be replaced to ensure fulfilment of functional requirements.
comment: Компонент (ы) или другой актив (ы) должны быть заменены для обеспечения выполнения функциональных требований. @ru
label: нуждается в замене @ru
term status: stable
example: An assembly component's service duration has exceeded its (theoretical, e.g., per EN 50126) mean time to failure, and is marked as needing replacement.

no pedigree match
type: NamedIndividual
type: CBV Code Lists
type: Disposition ID
comment: In validating the pedigree for the object, no match was found, causing the product to be quarantined for further investigation and disposition.
comment: При проверке источника происхождения объекта не было найдено соответствий, что привело к тому, что продукт находится на карантине для дальнейшего расследования и диспозиции. @ru
label: нет совпадения @ru
term status: stable
example: Distributor Y could not obtain a valid pedigree for a product from its Manufacturer A Business step: - `holding` - `staging_outbound` - `storing`

non conformant
type: NamedIndividual
type: CBV Code Lists
type: Disposition ID
comment: Outcome of an unsuccessful/failed inspection in an `inspecting` or `repairing` step. (`non_conformant` is the opposite of `available`).
comment: Результат неудачной/неудачной проверки на этапе `проверки` или `ремонта`. (`non_conformant` - это противоположность `available`). @ru
label: несоответствующий @ru
term status: stable
example: A mechanical component has been failed conformity testing against safety or performance requirements. If disposition is `non_conformant``, follow up steps may be used to capture subsequent and/or final disposition. For example, if the `non_conformant` object is not usable, it might be moved to a separate location for storage. If the object is still installed in an assembly but not function-critical, the assembly might be allowed to continue running until the next repair cycle; alternatively, a disassembly event might follow.

non sellable other
type: NamedIndividual
type: CBV Code Lists
type: Disposition ID
comment: Object cannot be sold to a customer.
comment: Объект не может быть продан клиенту. @ru
label: подлежит продаже, другое @ru
term status: stable
example: A product is not sellable pending further evaluation. A product is not sellable, and one of the other dispositions (`expired`, `recalled`, `damaged`, `no_pedigree_match`) does not apply. Product has been sold and is awaiting customer pick-up. Business step: - `holding` - `inspecting` - `staging_outbound` - `storing`

partially dispensed
type: NamedIndividual
type: CBV Code Lists
type: Disposition ID
comment: A portion of a product is distributed to a customer, while additional product is retained for subsequent distribution.
comment: Часть продукта распространяется среди клиентов, в то время как дополнительный продукт сохраняется для последующего распространения. @ru
label: частично распределенный @ru
term status: stable
example: A pharmacist dispenses 10 pills from a 100-count bottle to fill a customer prescription. A deli manager slides and packages one pound of a 10 pound ham for customer purchase. NOTE: This disposition reflects the disposition of the original object, not what was dispensed.

recalled
type: NamedIndividual
type: CBV Code Lists
type: Disposition ID
comment: Object is non-sellable because of public safety reasons.
comment: Объект не подлежит продаже из соображений общественной безопасности. @ru
label: отозван @ru
term status: stable
example: Manufacturer A requested that all Retailers and Distributors return its batteries that could overheat and explode. Business step: - `holding` - `staging_outbound` - `storing`

reserved
type: NamedIndividual
type: CBV Code Lists
type: Disposition ID
comment: Instance-level identifier has been allocated for a third party.
comment: Идентификатор уровня экземпляра был выделен третьей стороне. @ru
label: зарезервирован @ru
term status: stable
example: Distributor receives EPC numbers and can encode tag with the numbers. Business step: - `reserving`

retail sold
type: NamedIndividual
type: CBV Code Lists
type: Disposition ID
comment: Product has been purchased by a customer.
comment: Продукт был приобретен клиентом. @ru
label: розничная продажа @ru
term status: stable
example: A customer at Retailer X purchased a screwdriver by checking it out through the point of sale system. Business step: - `retail_selling`

returned
type: NamedIndividual
type: CBV Code Lists
type: Disposition ID
comment: Object has been sent or brought back for various reasons. It may or may not be sellable.
comment: Объект был отправлен обратно по разным причинам. Он может подлежать или не подлежать продаже. @ru
label: возвращен @ru
term status: stable
example: Product is received at a returns centre from a customer because of an over-shipment, recall, expired product, etc. Product is returned to retail POS by a customer, who no longer wants the product. Business step: - `receiving` - `holding` - `shipping`

sellable accessible
type: NamedIndividual
type: CBV Code Lists
type: Disposition ID
comment: Product can be sold as is and customer can access product for purchase.
comment: Продукт подлежит продаже как есть и клиент может получить доступ к продукт для совершения покупки. @ru
label: подлежит продаже и доступен @ru
term status: stable
example: Retailer X puts a case of screwdrivers on to a shelf or display within customer reach. Business step: - `stocking` - `receiving`

sellable not accessible
type: NamedIndividual
type: CBV Code Lists
type: Disposition ID
comment: Product can be sold as is, but customer cannot access product for purchase.
comment: Продукт подлежит продаже как есть, но клиент не может получить к нему доступ для совершения покупки. @ru
label: подлежит продаже, но недоступен @ru
term status: stable
example: Retailer X puts a case of screwdrivers on to a shelf in a store backroom. Business step: - `receiving` - `storing` - `loading` - `holding` - `inspecting`

stolen
type: NamedIndividual
type: CBV Code Lists
type: Disposition ID
comment: An object has been taken without permission or right.
comment: Объект был взят без разрешения или прав. @ru
label: украден @ru
term status: stable
example: A pharmaceutical manufacturer completes an investigation of serial numbers that are missing from inventory, and concludes that they have been stolen.

unavailable
type: NamedIndividual
type: CBV Code Lists
type: Disposition ID
comment: Object has been removed from service or from the supply chain (e.g., pending repair).
comment: Объект был выведен из эксплуатации или исключен из цепочки поставок (например, в ожидании ремонта).
label: недоступный @ru
term status: stable
example: A mechanical component in need of maintenance is taken out of service.

unknown
type: NamedIndividual
type: CBV Code Lists
type: Disposition ID
comment: An object's condition is not known.
comment: Состояние объекта неизвестно @ru
label: неизвестно @ru
term status: stable

Error Reason
type: Class
comment: These identifiers may be used to populate the reason attribute of an errorDeclaration element in an EPCIS event.
comment: Эти идентификаторы могут использоваться для заполнения атрибута причины элемента объявления ошибки в событии EPCIS. @ru
label: Причины ошибок @ru
subclass of: CBV Code Lists
term status: stable

did not occur
type: NamedIndividual
type: CBV Code Lists
type: Error Reason
comment: The prior event is considered erroneous because it did not actually occur. There are no corrective events. (In a CBV-Compliant Document, this error reason SHALL NOT be used in an error declaration that contains one or more corrective event IDs.)
comment: Предыдущее событие считается ошибочным, поскольку оно на самом деле не произошло. Корректирующих событий нет. (В документе, совместимом с CBV, эта причина ошибки не должна использоваться в объявлении ошибки, содержащем один или несколько идентификаторов корректирующих событий.) @ru
label: не произошло @ru
term status: stable

incorrect data
type: NamedIndividual
type: CBV Code Lists
type: Error Reason
comment: The prior event is considered erroneous because some or all of the data in the event are incorrect. Subsequent events may provide a correct indication of what actually occurred when the prior event was captured. These events may be linked using the corrective event IDs in the error declaration.
comment: Предыдущее событие считается ошибочным, поскольку некоторые или все данные в событии неверны. Последующие события могут дать правильное представление о том, что на самом деле произошло, когда было зафиксировано предыдущее событие. Эти события могут быть связаны с использованием идентификаторов корректирующих событий в объявлении ошибки. @ru
label: неверные данные @ru
term status: stable

Source/Destination Type
type: Class
comment: These identifiers may be used to populate the type attribute of a source or destination element in an EPCIS event.
comment: Эти идентификаторы могут использоваться для заполнения атрибута типа элемента "Источника" или "Пункта назначения" в событии EPCIS. @ru
label: Источник/Получатель @ru
subclass of: CBV Code Lists
term status: stable

location
type: NamedIndividual
type: CBV Code Lists
type: Source/Destination Type
comment: The source or destination identifier denotes the physical location of the originating endpoint or terminating endpoint (respectively) of the business transfer of which this EPCIS event is a part. When a source of this type is specified on an EPCIS event at the originating endpoint of a business transfer, the source identifier SHOULD be consistent with the Read Point specified in that event. When a destination of this type is specified on an EPCIS event at the terminating endpoint of a business transfer, the destination identifier SHOULD be consistent with the Read Point specified in that event.
comment: Идентификатор источника или пункта назначения обозначает физическое местоположение исходного пункта или конечного пункта (соответственно) бизнес-операции по передаче груза, частью которой является данное событие EPCIS. Если источник этого типа указывается в событии EPCIS в исходной точке бизнес-передачи, то идентификатор источника должен соответствовать контрольной точке, указанной в этом событии (the source identifier SHOULD be consistent with the Read Point specified in that event). Если пункт назначения этого типа указывается в событии EPCIS в конечной точке бизнес-передачи, то идентификатор пункта назначения должен соответствовать контрольной точке, указанной в этом событии (the source identifier SHOULD be consistent with the Read Point specified in that event). @ru
label: метоположение @ru
term status: stable

owning party
type: NamedIndividual
type: CBV Code Lists
type: Source/Destination Type
comment: The source or destination identifier denotes the party who owns (or is intended to own) the objects at the originating endpoint or terminating endpoint (respectively) of the business transfer of which this EPCIS event is a part.
comment: Идентификатор источника или пункта назначения обозначает сторону, которая является собственником (или должна являться собственником) объектов в исходном пункте либо в конечном пункте (соответственно) бизнес-операции по передаче груза, частью которой является данное событие EPCIS. @ru
label: сторона-собственница @ru
term status: stable

possessing party
type: NamedIndividual
type: CBV Code Lists
type: Source/Destination Type
comment: The source or destination identifier denotes the party who has (or is intended to have) physical possession of the objects at the originating endpoint or terminating endpoint (respectively) of the business transfer of which this EPCIS event is a part.
comment: Идентификатор источника или пункта назначения обозначает сторону, которая физически владеет (или должна владеть) объектами в исходном пункте либо в конечном пункте (соответственно) бизнес-операции по передаче груза, частью которой является данное событие EPCIS. @ru
label: сторона-владелец @ru
term status: stable